BDBM124826 US8759386, 23
SMILES: CCc1nn(Cc2ccc(NC(=O)c3cc4cc(F)ccc4[nH]3)cc2)c(CC)c1CC(O)=O
InChI Key: InChIKey=KJFQIMRSZAOSGY-UHFFFAOYSA-N
Data: 1 KI
Activity Spreadsheet -- Enzyme Inhibition Constant Data from BindingDB
Found 1 hit for monomerid = 124826
Trg + Lig
Ki
nM
ΔG°
kcal/mole
IC50
nM
Kd
nM
EC50/IC50
nM
koff
s-1
kon
M-1s-1
pHTemp
°C
Prostaglandin D2 receptor 2
(Homo sapiens (Human))
BDBM124826
(US8759386, 23)
Show SMILES CCc1nn(Cc2ccc(NC(=O)c3cc4cc(F)ccc4[nH]3)cc2)c(CC)c1CC(O)=O
Show InChI InChI=1S/C25H25FN4O3/c1-3-20-19(13-24(31)32)23(4-2)30(29-20)14-15-5-8-18(9-6-15)27-25(33)22-12-16-11-17(26)7-10-21(16)28-22/h5-12,28H,3-4,13-14H2,1-2H3,(H,27,33)(H,31,32)
Reactome pathway
US Patent
0.300 -13.0n/an/an/an/an/a7.425
Boehringer Ingelheim International GmbH
US Patent
Assay Description
The CRTH2 receptor binding assay is performed in a scintillation proximity assay (SPA) format with the radioligand [3H]-PGD2 (Perkin Elmer, NET616000...
US Patent US8759386 (2014)
BindingDB Entry DOI: 10.7270/Q2S46QM5