BDBM12483 (2S)-({N-[3-({[(5S,8S,10R)-5-cyclohexyl-3,6-dioxo-11,16-dioxa-4,7-diazatricyclo[15.3.1.17,10]docosa-1(21),17,19-trien-8-yl]carbonyl}amino)-2-oxohexanoyl]glycyl}amino)(phenyl)acetic acid N,N-dimethyl amide::3-{[(5S,8S,10R)-5-cyclohexyl-3,6-dioxo-11,16-dioxa-4,7-diazatricyclo[15.3.1.1^{7,10}]docosa-1(20),17(21),18-trien-8-yl]formamido}-N-({[(S)-(dimethylcarbamoyl)(phenyl)methyl]carbamoyl}methyl)-2-oxohexanamide::Proline-Based Macrocycle 34
SMILES: CCCC(NC(=O)[C@@H]1C[C@@H]2CN1C(=O)[C@@H](NC(=O)Cc1cccc(OCCCCO2)c1)C1CCCCC1)C(=O)C(=O)NCC(=O)N[C@H](C(=O)N(C)C)c1ccccc1
InChI Key: InChIKey=TUNGZPBSCWHLFB-UYEJHXQVSA-N
Data: 1 KI
Activity Spreadsheet -- Enzyme Inhibition Constant Data from BindingDB
Found 1 hit for monomerid = 12483
Trg + Lig
Ki
nM
ΔG°
kcal/mole
IC50
nM
Kd
nM
EC50/IC50
nM
koff
s-1
kon
M-1s-1
pHTemp
°C
HCV NS3-NS4A Serine Proteinase
(Hepatitis C virus (HCV genotype 1a, isolate H))
BDBM12483
((2S)-({N-[3-({[(5S,8S,10R)-5-cyclohexyl-3,6-dioxo-...)
Show SMILES CCCC(NC(=O)[C@@H]1C[C@@H]2CN1C(=O)[C@@H](NC(=O)Cc1cccc(OCCCCO2)c1)C1CCCCC1)C(=O)C(=O)NCC(=O)N[C@H](C(=O)N(C)C)c1ccccc1 |r|
Show InChI InChI=1S/C43H58N6O9/c1-4-14-33(39(52)41(54)44-26-36(51)47-37(42(55)48(2)3)29-16-7-5-8-17-29)45-40(53)34-25-32-27-49(34)43(56)38(30-18-9-6-10-19-30)46-35(50)24-28-15-13-20-31(23-28)57-21-11-12-22-58-32/h5,7-8,13,15-17,20,23,30,32-34,37-38H,4,6,9-12,14,18-19,21-22,24-27H2,1-3H3,(H,44,54)(H,45,53)(H,46,50)(H,47,51)/t32-,33?,34+,37+,38+/m1/s1
7 -11.3n/an/an/an/an/a6.530
Schering-Plough Research Institute
Assay Description
Proteolytic cleavage of the ester linkage between the Nva (L-norvaline) and the chromophore (PAP) was monitored for change in absorbance at 370 nm. I...
J Med Chem 49: 995-1005 (2006)
Article DOI: 10.1021/jm050820s
BindingDB Entry DOI: 10.7270/Q2H70D13