BDBM124839 US8759386, 36
SMILES: Cc1nn(Cc2ccc(NC(=O)c3cc4ccc(Cl)cc4o3)cc2)c(C)c1CC(O)=O
InChI Key: InChIKey=SDXGZOKZFZDUMV-UHFFFAOYSA-N
Data: 1 KI
Activity Spreadsheet -- Enzyme Inhibition Constant Data from BindingDB
Found 1 hit for monomerid = 124839
Trg + Lig
Ki
nM
ΔG°
kcal/mole
IC50
nM
Kd
nM
EC50/IC50
nM
koff
s-1
kon
M-1s-1
pHTemp
°C
Prostaglandin D2 receptor 2
(Homo sapiens (Human))
BDBM124839
(US8759386, 36)
Show SMILES Cc1nn(Cc2ccc(NC(=O)c3cc4ccc(Cl)cc4o3)cc2)c(C)c1CC(O)=O
Show InChI InChI=1S/C23H20ClN3O4/c1-13-19(11-22(28)29)14(2)27(26-13)12-15-3-7-18(8-4-15)25-23(30)21-9-16-5-6-17(24)10-20(16)31-21/h3-10H,11-12H2,1-2H3,(H,25,30)(H,28,29)
Reactome pathway
US Patent
0.200 -13.2n/an/an/an/an/a7.425
Boehringer Ingelheim International GmbH
US Patent
Assay Description
The CRTH2 receptor binding assay is performed in a scintillation proximity assay (SPA) format with the radioligand [3H]-PGD2 (Perkin Elmer, NET616000...
US Patent US8759386 (2014)
BindingDB Entry DOI: 10.7270/Q2S46QM5