BDBM124865 US8759365, 6-2
SMILES: CC[C@@H]1C[C@@H](CN1C(=O)OCC(C)(C)C)N(Cc1cc(cc(c1)C(F)(F)F)C(F)(F)F)c1ncc(cn1)-c1cnn(C)c1
InChI Key: InChIKey=VGLXUQVSJICPGA-RPWUZVMVSA-N
Data: 1 IC50
Activity Spreadsheet -- Enzyme Inhibition Constant Data from BindingDB
Found 1 hit for monomerid = 124865
Trg + Lig
Ki
nM
ΔG°
kcal/mole
IC50
nM
Kd
nM
EC50/IC50
nM
koff
s-1
kon
M-1s-1
pHTemp
°C
Cholesteryl ester transfer protein
(Homo sapiens (Human))
BDBM124865
(US8759365, 6-2)
Show SMILES CC[C@@H]1C[C@@H](CN1C(=O)OCC(C)(C)C)N(Cc1cc(cc(c1)C(F)(F)F)C(F)(F)F)c1ncc(cn1)-c1cnn(C)c1 |r|
Show InChI InChI=1S/C29H34F6N6O2/c1-6-23-10-24(16-41(23)26(42)43-17-27(2,3)4)40(25-36-11-19(12-37-25)20-13-38-39(5)15-20)14-18-7-21(28(30,31)32)9-22(8-18)29(33,34)35/h7-9,11-13,15,23-24H,6,10,14,16-17H2,1-5H3/t23-,24+/m1/s1
Reactome pathway
US Patent
n/an/a 47n/an/an/an/a7.437
Novartis AG
US Patent
Assay Description
CETP Activity Kit (#RB-RPAK) was purchased from Roar Biochemical, Inc. (New York, N.Y., USA). To each well of a 96-well NBS half-area plate (costar #...
US Patent US8759365 (2014)
BindingDB Entry DOI: 10.7270/Q2NG4P95