BDBM124877 US8759365, 18
SMILES: CC[C@@H]1C[C@@H](CN1C(=O)N(C)C)N(Cc1cc(cc(c1)C(F)(F)F)C(F)(F)F)c1ncc(cn1)-c1cnn(C)c1
InChI Key: InChIKey=FAHMNJNQQWSUFF-YADHBBJMSA-N
Data: 1 IC50
Activity Spreadsheet -- Enzyme Inhibition Constant Data from BindingDB
Found 1 hit for monomerid = 124877
Trg + Lig
Ki
nM
ΔG°
kcal/mole
IC50
nM
Kd
nM
EC50/IC50
nM
koff
s-1
kon
M-1s-1
pHTemp
°C
Cholesteryl ester transfer protein
(Homo sapiens (Human))
BDBM124877
(US8759365, 18)
Show SMILES CC[C@@H]1C[C@@H](CN1C(=O)N(C)C)N(Cc1cc(cc(c1)C(F)(F)F)C(F)(F)F)c1ncc(cn1)-c1cnn(C)c1
Show InChI InChI=1S/C26H29F6N7O/c1-5-21-9-22(15-39(21)24(40)36(2)3)38(23-33-10-17(11-34-23)18-12-35-37(4)14-18)13-16-6-19(25(27,28)29)8-20(7-16)26(30,31)32/h6-8,10-12,14,21-22H,5,9,13,15H2,1-4H3/t21-,22+/m1/s1
Reactome pathway
US Patent
n/an/a 63n/an/an/an/a7.437
Novartis AG
US Patent
Assay Description
CETP Activity Kit (#RB-RPAK) was purchased from Roar Biochemical, Inc. (New York, N.Y., USA). To each well of a 96-well NBS half-area plate (costar #...
US Patent US8759365 (2014)
BindingDB Entry DOI: 10.7270/Q2NG4P95