BDBM124881 US8759365, 14
SMILES: CC[C@@H]1C[C@@H](CN1C(=O)OC(C)C)N(Cc1cc(cc(c1)C(F)(F)F)C(F)(F)F)c1ncc(cn1)-c1cn[nH]c1
InChI Key: InChIKey=KPMJBEMPGXNBGS-YADHBBJMSA-N
Data: 1 IC50
Activity Spreadsheet -- Enzyme Inhibition Constant Data from BindingDB
Found 1 hit for monomerid = 124881
Trg + Lig
Ki
nM
ΔG°
kcal/mole
IC50
nM
Kd
nM
EC50/IC50
nM
koff
s-1
kon
M-1s-1
pHTemp
°C
Cholesteryl ester transfer protein
(Homo sapiens (Human))
BDBM124881
(US8759365, 14)
Show SMILES CC[C@@H]1C[C@@H](CN1C(=O)OC(C)C)N(Cc1cc(cc(c1)C(F)(F)F)C(F)(F)F)c1ncc(cn1)-c1cn[nH]c1
Show InChI InChI=1S/C26H28F6N6O2/c1-4-21-8-22(14-38(21)24(39)40-15(2)3)37(23-33-9-17(10-34-23)18-11-35-36-12-18)13-16-5-19(25(27,28)29)7-20(6-16)26(30,31)32/h5-7,9-12,15,21-22H,4,8,13-14H2,1-3H3,(H,35,36)/t21-,22+/m1/s1
Reactome pathway
US Patent
n/an/a 34n/an/an/an/a7.437
Novartis AG
US Patent
Assay Description
CETP Activity Kit (#RB-RPAK) was purchased from Roar Biochemical, Inc. (New York, N.Y., USA). To each well of a 96-well NBS half-area plate (costar #...
US Patent US8759365 (2014)
BindingDB Entry DOI: 10.7270/Q2NG4P95