BDBM124968 US8765820, 6e
SMILES: NC1CC1c1ccc(NC(=O)C(Cc2ccccc2)NC(=O)COc2ccccc2)cc1
InChI Key: InChIKey=CRXLMFBVWJGNTJ-UHFFFAOYSA-N
Data: 3 KI
Activity Spreadsheet -- Enzyme Inhibition Constant Data from BindingDB
Found 3 hits for monomerid = 124968
Trg + Lig
Ki
nM
ΔG°
kcal/mole
IC50
nM
Kd
nM
EC50/IC50
nM
koff
s-1
kon
M-1s-1
pHTemp
°C
Lysine-specific histone demethylase 1A
(Homo sapiens (Human))
BDBM124968
(US8765820, 6e)
Show SMILES NC1CC1c1ccc(NC(=O)C(Cc2ccccc2)NC(=O)COc2ccccc2)cc1
Show InChI InChI=1S/C26H27N3O3/c27-23-16-22(23)19-11-13-20(14-12-19)28-26(31)24(15-18-7-3-1-4-8-18)29-25(30)17-32-21-9-5-2-6-10-21/h1-14,22-24H,15-17,27H2,(H,28,31)(H,29,30)
Reactome pathway
US Patent
1.30E+3n/an/an/an/an/an/a7.5n/a
Universita Degli Studi di Roma “La Sapienza”; Fondazione IEO; Universita Degli Studi di Pavia; Universita Degli Studi di Milano
US Patent
Assay Description
Human recombinant MAO A and MAO B were expressed in Pichia pastoris and purified as published (Binda C, et al., Proc. Natl. Acad. Sci. USA 100: 9750-...
US Patent US8765820 (2014)
BindingDB Entry DOI: 10.7270/Q20P0XPN
Amine oxidase (flavin-containing) A
(Homo sapiens (Human))
BDBM124968
(US8765820, 6e)
Show SMILES NC1CC1c1ccc(NC(=O)C(Cc2ccccc2)NC(=O)COc2ccccc2)cc1
Show InChI InChI=1S/C26H27N3O3/c27-23-16-22(23)19-11-13-20(14-12-19)28-26(31)24(15-18-7-3-1-4-8-18)29-25(30)17-32-21-9-5-2-6-10-21/h1-14,22-24H,15-17,27H2,(H,28,31)(H,29,30)
US Patent
1.25E+4n/an/an/an/an/an/a7.5n/a
Universita Degli Studi di Roma “La Sapienza”; Fondazione IEO; Universita Degli Studi di Pavia; Universita Degli Studi di Milano
US Patent
Assay Description
Human recombinant MAO A and MAO B were expressed in Pichia pastoris and purified as published (Binda C, et al., Proc. Natl. Acad. Sci. USA 100: 9750-...
US Patent US8765820 (2014)
BindingDB Entry DOI: 10.7270/Q20P0XPN
Lysine-specific histone demethylase 2 (LSD2)
(Mus musculus (Mouse))
BDBM124968
(US8765820, 6e)
Show SMILES NC1CC1c1ccc(NC(=O)C(Cc2ccccc2)NC(=O)COc2ccccc2)cc1
Show InChI InChI=1S/C26H27N3O3/c27-23-16-22(23)19-11-13-20(14-12-19)28-26(31)24(15-18-7-3-1-4-8-18)29-25(30)17-32-21-9-5-2-6-10-21/h1-14,22-24H,15-17,27H2,(H,28,31)(H,29,30)
US Patent
3.80E+4n/an/an/an/an/an/a7.5n/a
Universita Degli Studi di Roma “La Sapienza”; Fondazione IEO; Universita Degli Studi di Pavia; Universita Degli Studi di Milano
US Patent
Assay Description
Human recombinant MAO A and MAO B were expressed in Pichia pastoris and purified as published (Binda C, et al., Proc. Natl. Acad. Sci. USA 100: 9750-...
US Patent US8765820 (2014)
BindingDB Entry DOI: 10.7270/Q20P0XPN