BDBM12499 (2S)-2-[(3S)-3-[(6-chloronaphthalene-2-)sulfonamido]-2-oxopyrrolidin-1-yl]-N,N-dimethylpropanamide::P4 alanylamide pyrrolidin-2-one 11
SMILES: C[C@H](N1CC[C@H](NS(=O)(=O)c2ccc3cc(Cl)ccc3c2)C1=O)C(=O)N(C)C
InChI Key: InChIKey=IKUIMFDSERPHCP-SJCJKPOMSA-N
Data: 1 KI
PDB links: 2 PDB IDs contain this monomer as substructures. 2 PDB IDs contain inhibitors having a similarity of 90% to this monomer.
Activity Spreadsheet -- Enzyme Inhibition Constant Data from BindingDB
Found 1 hit for monomerid = 12499
Trg + Lig
Ki
nM
ΔG°
kcal/mole
IC50
nM
Kd
nM
EC50/IC50
nM
koff
s-1
kon
M-1s-1
pHTemp
°C
Coagulation factor X
(Homo sapiens (Human))
BDBM12499
((2S)-2-[(3S)-3-[(6-chloronaphthalene-2-)sulfonamid...)
Show SMILES C[C@H](N1CC[C@H](NS(=O)(=O)c2ccc3cc(Cl)ccc3c2)C1=O)C(=O)N(C)C |r|
Show InChI InChI=1S/C19H22ClN3O4S/c1-12(18(24)22(2)3)23-9-8-17(19(23)25)21-28(26,27)16-7-5-13-10-15(20)6-4-14(13)11-16/h4-7,10-12,17,21H,8-9H2,1-3H3/t12-,17-/m0/s1
Reactome pathway
346 -8.81n/an/an/an/an/a7.825
GlaxoSmithKline
Assay Description
The inhibitory effect of test compound for human fXa was determined by using the chromogenic substrate. The hydrolysis rates of chromogenic substrate...
Bioorg Med Chem Lett 16: 5953-7 (2006)
Article DOI: 10.1016/j.bmcl.2006.09.001
BindingDB Entry DOI: 10.7270/Q2CF9NB8