null
SMILES: CC(C)CN(CCC#N)C(=O)[C@H](C)N1CC[C@H](NS(=O)(=O)c2ccc3cc(Cl)ccc3c2)C1=O
InChI Key: InChIKey=AGADDEHLXINQCO-JTSKRJEESA-N
PDB links: 1 PDB ID contains inhibitors having a similarity of 90% to this monomer.
Activity Spreadsheet -- Enzyme Inhibition Constant Data from BindingDB
Found 1 hit for monomerid = 12507
Trg + Lig
Ki
nM
ΔG°
kcal/mole
IC50
nM
Kd
nM
EC50/IC50
nM
koff
s-1
kon
M-1s-1
pHTemp
°C
Coagulation factor X
(Homo sapiens (Human))
BDBM12507
((2S)-2-[(3S)-3-[(6-chloronaphthalene-2-)sulfonamid...)
Show SMILES CC(C)CN(CCC#N)C(=O)[C@H](C)N1CC[C@H](NS(=O)(=O)c2ccc3cc(Cl)ccc3c2)C1=O |r|
Show InChI InChI=1S/C24H29ClN4O4S/c1-16(2)15-28(11-4-10-26)23(30)17(3)29-12-9-22(24(29)31)27-34(32,33)21-8-6-18-13-20(25)7-5-19(18)14-21/h5-8,13-14,16-17,22,27H,4,9,11-12,15H2,1-3H3/t17-,22-/m0/s1
Reactome pathway
136 -9.36n/an/an/an/an/a7.825
GlaxoSmithKline
Assay Description
The inhibitory effect of test compound for human fXa was determined by using the chromogenic substrate. The hydrolysis rates of chromogenic substrate...
Bioorg Med Chem Lett 16: 5953-7 (2006)
Article DOI: 10.1016/j.bmcl.2006.09.001
BindingDB Entry DOI: 10.7270/Q2CF9NB8