BDBM12512 (2S)-2-[(3S)-3-[(6-chloronaphthalene-2-)sulfonamido]-2-oxopyrrolidin-1-yl]-N-(2-cyanoethyl)-N-cyclohexylpropanamide::P4 alanylamide pyrrolidin-2-one 23
SMILES: C[C@H](N1CC[C@H](NS(=O)(=O)c2ccc3cc(Cl)ccc3c2)C1=O)C(=O)N(CCC#N)C1CCCCC1
InChI Key: InChIKey=RMFIYMPMMQYQQE-UUOWRZLLSA-N
Data: 1 KI
PDB links: 1 PDB ID contains inhibitors having a similarity of 90% to this monomer.
Activity Spreadsheet -- Enzyme Inhibition Constant Data from BindingDB
Found 1 hit for monomerid = 12512
Trg + Lig
Ki
nM
ΔG°
kcal/mole
IC50
nM
Kd
nM
EC50/IC50
nM
koff
s-1
kon
M-1s-1
pHTemp
°C
Coagulation factor X
(Homo sapiens (Human))
BDBM12512
((2S)-2-[(3S)-3-[(6-chloronaphthalene-2-)sulfonamid...)
Show SMILES C[C@H](N1CC[C@H](NS(=O)(=O)c2ccc3cc(Cl)ccc3c2)C1=O)C(=O)N(CCC#N)C1CCCCC1 |r|
Show InChI InChI=1S/C26H31ClN4O4S/c1-18(25(32)31(14-5-13-28)22-6-3-2-4-7-22)30-15-12-24(26(30)33)29-36(34,35)23-11-9-19-16-21(27)10-8-20(19)17-23/h8-11,16-18,22,24,29H,2-7,12,14-15H2,1H3/t18-,24-/m0/s1
Reactome pathway
73 -9.73n/an/an/an/an/a7.825
GlaxoSmithKline
Assay Description
The inhibitory effect of test compound for human fXa was determined by using the chromogenic substrate. The hydrolysis rates of chromogenic substrate...
Bioorg Med Chem Lett 16: 5953-7 (2006)
Article DOI: 10.1016/j.bmcl.2006.09.001
BindingDB Entry DOI: 10.7270/Q2CF9NB8