null
SMILES: CCOc1ccc2cc(Cc3c4cc(OC)c(OC)cc4c(C)[nH]c3=O)cnc2c1
InChI Key: InChIKey=YTNJCRLIPXEDBY-UHFFFAOYSA-N
Activity Spreadsheet -- Enzyme Inhibition Constant Data from BindingDB
Found 1 hit for monomerid = 125547
Trg + Lig
Ki
nM
ΔG°
kcal/mole
IC50
nM
Kd
nM
EC50/IC50
nM
koff
s-1
kon
M-1s-1
pHTemp
°C
cAMP and cAMP-inhibited cGMP 3',5'-cyclic phosphodiesterase 10A
(Homo sapiens (Human))
BDBM125547
(US8772316, 30)
Show SMILES CCOc1ccc2cc(Cc3c4cc(OC)c(OC)cc4c(C)[nH]c3=O)cnc2c1
Show InChI InChI=1S/C24H24N2O4/c1-5-30-17-7-6-16-8-15(13-25-21(16)10-17)9-20-19-12-23(29-4)22(28-3)11-18(19)14(2)26-24(20)27/h6-8,10-13H,5,9H2,1-4H3,(H,26,27)
Reactome pathway
US Patent
n/an/a 21n/an/an/an/a7.4n/a
Allergan, Inc.; Exonhit Therapeutics SA
US Patent
Assay Description
The PDE assay is based on the homogenous time-resolved fluorescence resonance energy transfer (TR-FRET) technology (LANCE from Perkin Elmer). This co...
US Patent US8772316 (2014)
BindingDB Entry DOI: 10.7270/Q2Q81BR8