BDBM125551 US8772316, 34
SMILES: CCCc1[nH]c(=O)c(Cc2cc3cc(C)ccc3nc2NC)c2cc(OC)c(OC)cc12
InChI Key: InChIKey=LWHSBPMWAWBBRH-UHFFFAOYSA-N
Data: 1 IC50
Activity Spreadsheet -- Enzyme Inhibition Constant Data from BindingDB
Found 1 hit for monomerid = 125551
Trg + Lig
Ki
nM
ΔG°
kcal/mole
IC50
nM
Kd
nM
EC50/IC50
nM
koff
s-1
kon
M-1s-1
pHTemp
°C
cAMP and cAMP-inhibited cGMP 3',5'-cyclic phosphodiesterase 10A
(Homo sapiens (Human))
BDBM125551
(US8772316, 34)
Show SMILES CCCc1[nH]c(=O)c(Cc2cc3cc(C)ccc3nc2NC)c2cc(OC)c(OC)cc12
Show InChI InChI=1S/C26H29N3O3/c1-6-7-22-19-14-24(32-5)23(31-4)13-18(19)20(26(30)29-22)12-17-11-16-10-15(2)8-9-21(16)28-25(17)27-3/h8-11,13-14H,6-7,12H2,1-5H3,(H,27,28)(H,29,30)
Reactome pathway
US Patent
n/an/a 1.90n/an/an/an/a7.4n/a
Allergan, Inc.; Exonhit Therapeutics SA
US Patent
Assay Description
The PDE assay is based on the homogenous time-resolved fluorescence resonance energy transfer (TR-FRET) technology (LANCE from Perkin Elmer). This co...
US Patent US8772316 (2014)
BindingDB Entry DOI: 10.7270/Q2Q81BR8