BDBM12556 6-chloro-N-[(3S)-2-oxo-1-[2-oxo-2-(piperidin-1-yl)ethyl]pyrrolidin-3-yl]naphthalene-2-sulfonamide::pyrrolidin-2-one-based inhibitor 4
SMILES: Clc1ccc2cc(ccc2c1)S(=O)(=O)N[C@H]1CCN(CC(=O)N2CCCCC2)C1=O
InChI Key: InChIKey=JGFOOSCAWPOWNG-IBGZPJMESA-N
Data: 1 KI
PDB links: 1 PDB ID contains inhibitors having a similarity of 90% to this monomer.
Activity Spreadsheet -- Enzyme Inhibition Constant Data from BindingDB
Found 1 hit for monomerid = 12556
Trg + Lig
Ki
nM
ΔG°
kcal/mole
IC50
nM
Kd
nM
EC50/IC50
nM
koff
s-1
kon
M-1s-1
pHTemp
°C
Coagulation factor X
(Homo sapiens (Human))
BDBM12556
(6-chloro-N-[(3S)-2-oxo-1-[2-oxo-2-(piperidin-1-yl)...)
Show SMILES Clc1ccc2cc(ccc2c1)S(=O)(=O)N[C@H]1CCN(CC(=O)N2CCCCC2)C1=O |r|
Show InChI InChI=1S/C21H24ClN3O4S/c22-17-6-4-16-13-18(7-5-15(16)12-17)30(28,29)23-19-8-11-25(21(19)27)14-20(26)24-9-2-1-3-10-24/h4-7,12-13,19,23H,1-3,8-11,14H2/t19-/m0/s1
Reactome pathway
63 -9.82n/an/an/an/an/a7.825
GlaxoSmithKline
Assay Description
The inhibitory effect of test compound for human fXa was determined by using the chromogenic substrate. The hydrolysis rates of chromogenic substrate...
Bioorg Med Chem Lett 16: 3784-8 (2006)
Article DOI: 10.1016/j.bmcl.2006.04.053
BindingDB Entry DOI: 10.7270/Q2416V9V