null
SMILES: CCCc1[nH]c(=O)c(Cc2ccc3nc(C)ccc3c2)c2cc(OC)c(OC)cc12
InChI Key: InChIKey=MUEFTPVHZGZPNR-UHFFFAOYSA-N
Activity Spreadsheet -- Enzyme Inhibition Constant Data from BindingDB
Found 1 hit for monomerid = 125597
Trg + Lig
Ki
nM
ΔG°
kcal/mole
IC50
nM
Kd
nM
EC50/IC50
nM
koff
s-1
kon
M-1s-1
pHTemp
°C
cAMP and cAMP-inhibited cGMP 3',5'-cyclic phosphodiesterase 10A
(Homo sapiens (Human))
BDBM125597
(US8772316, 80)
Show SMILES CCCc1[nH]c(=O)c(Cc2ccc3nc(C)ccc3c2)c2cc(OC)c(OC)cc12
Show InChI InChI=1S/C25H26N2O3/c1-5-6-22-19-14-24(30-4)23(29-3)13-18(19)20(25(28)27-22)12-16-8-10-21-17(11-16)9-7-15(2)26-21/h7-11,13-14H,5-6,12H2,1-4H3,(H,27,28)
Reactome pathway
US Patent
n/an/a 3.20n/an/an/an/a7.4n/a
Allergan, Inc.; Exonhit Therapeutics SA
US Patent
Assay Description
The PDE assay is based on the homogenous time-resolved fluorescence resonance energy transfer (TR-FRET) technology (LANCE from Perkin Elmer). This co...
US Patent US8772316 (2014)
BindingDB Entry DOI: 10.7270/Q2Q81BR8