null
SMILES: CCc1[nH]c(=O)c(Cc2ccc3nc(C)ccc3c2)c2cc(OC)c(OC)cc12
InChI Key: InChIKey=LCSXCBSZZHCJFL-UHFFFAOYSA-N
Activity Spreadsheet -- Enzyme Inhibition Constant Data from BindingDB
Found 1 hit for monomerid = 125598
Trg + Lig
Ki
nM
ΔG°
kcal/mole
IC50
nM
Kd
nM
EC50/IC50
nM
koff
s-1
kon
M-1s-1
pHTemp
°C
cAMP and cAMP-inhibited cGMP 3',5'-cyclic phosphodiesterase 10A
(Homo sapiens (Human))
BDBM125598
(US8772316, 81)
Show SMILES CCc1[nH]c(=O)c(Cc2ccc3nc(C)ccc3c2)c2cc(OC)c(OC)cc12
Show InChI InChI=1S/C24H24N2O3/c1-5-20-18-13-23(29-4)22(28-3)12-17(18)19(24(27)26-20)11-15-7-9-21-16(10-15)8-6-14(2)25-21/h6-10,12-13H,5,11H2,1-4H3,(H,26,27)
Reactome pathway
US Patent
n/an/a 7.5n/an/an/an/a7.4n/a
Allergan, Inc.; Exonhit Therapeutics SA
US Patent
Assay Description
The PDE assay is based on the homogenous time-resolved fluorescence resonance energy transfer (TR-FRET) technology (LANCE from Perkin Elmer). This co...
US Patent US8772316 (2014)
BindingDB Entry DOI: 10.7270/Q2Q81BR8