BDBM12563 6-chloro-N-[(3S)-2-oxo-1-[(2S)-1-oxo-1-(piperazin-1-yl)propan-2-yl]pyrrolidin-3-yl]naphthalene-2-sulfonamide::pyrrolidin-2-one-based inhibitor 22
SMILES: C[C@H](N1CC[C@H](NS(=O)(=O)c2ccc3cc(Cl)ccc3c2)C1=O)C(=O)N1CCNCC1
InChI Key: InChIKey=OXYRWTWFZSETPA-LIRRHRJNSA-N
Data: 1 KI
PDB links: 2 PDB IDs contain inhibitors having a similarity of 90% to this monomer.
Activity Spreadsheet -- Enzyme Inhibition Constant Data from BindingDB
Found 1 hit for monomerid = 12563
Trg + Lig
Ki
nM
ΔG°
kcal/mole
IC50
nM
Kd
nM
EC50/IC50
nM
koff
s-1
kon
M-1s-1
pHTemp
°C
Coagulation factor X
(Homo sapiens (Human))
BDBM12563
(6-chloro-N-[(3S)-2-oxo-1-[(2S)-1-oxo-1-(piperazin-...)
Show SMILES C[C@H](N1CC[C@H](NS(=O)(=O)c2ccc3cc(Cl)ccc3c2)C1=O)C(=O)N1CCNCC1 |r|
Show InChI InChI=1S/C21H25ClN4O4S/c1-14(20(27)25-10-7-23-8-11-25)26-9-6-19(21(26)28)24-31(29,30)18-5-3-15-12-17(22)4-2-16(15)13-18/h2-5,12-14,19,23-24H,6-11H2,1H3/t14-,19-/m0/s1
Reactome pathway
320 -8.85n/an/an/an/an/a7.825
GlaxoSmithKline
Assay Description
The inhibitory effect of test compound for human fXa was determined by using the chromogenic substrate. The hydrolysis rates of chromogenic substrate...
Bioorg Med Chem Lett 16: 3784-8 (2006)
Article DOI: 10.1016/j.bmcl.2006.04.053
BindingDB Entry DOI: 10.7270/Q2416V9V