BDBM12574 6-chloro-N-[(3R)-2-oxo-1-[(2S)-1-oxo-1-(piperidin-1-yl)propan-2-yl]pyrrolidin-3-yl]naphthalene-2-sulfonamide::pyrrolidin-2-one-based inhibitor 36
SMILES: C[C@H](N1CC[C@@H](NS(=O)(=O)c2ccc3cc(Cl)ccc3c2)C1=O)C(=O)N1CCCCC1
InChI Key: InChIKey=RFBGMIUDFJBOHN-MGPUTAFESA-N
Data: 1 KI
PDB links: 1 PDB ID contains inhibitors having a similarity of 90% to this monomer.
Activity Spreadsheet -- Enzyme Inhibition Constant Data from BindingDB
Found 1 hit for monomerid = 12574
Trg + Lig
Ki
nM
ΔG°
kcal/mole
IC50
nM
Kd
nM
EC50/IC50
nM
koff
s-1
kon
M-1s-1
pHTemp
°C
Coagulation factor X
(Homo sapiens (Human))
BDBM12574
(6-chloro-N-[(3R)-2-oxo-1-[(2S)-1-oxo-1-(piperidin-...)
Show SMILES C[C@H](N1CC[C@@H](NS(=O)(=O)c2ccc3cc(Cl)ccc3c2)C1=O)C(=O)N1CCCCC1 |r|
Show InChI InChI=1S/C22H26ClN3O4S/c1-15(21(27)25-10-3-2-4-11-25)26-12-9-20(22(26)28)24-31(29,30)19-8-6-16-13-18(23)7-5-17(16)14-19/h5-8,13-15,20,24H,2-4,9-12H2,1H3/t15-,20+/m0/s1
Reactome pathway
16 -10.6n/an/an/an/an/a7.825
GlaxoSmithKline
Assay Description
The inhibitory effect of test compound for human fXa was determined by using the chromogenic substrate. The hydrolysis rates of chromogenic substrate...
Bioorg Med Chem Lett 16: 3784-8 (2006)
Article DOI: 10.1016/j.bmcl.2006.04.053
BindingDB Entry DOI: 10.7270/Q2416V9V