BDBM12589 (2R,3S)-3-({[5-chloro-2-(1H-1,2,3,4-tetrazol-1-yl)phenyl]methyl}amino)-2-hydroxy-N-(4-methoxyphenyl)-4-phenylbutane-1-sulfonamido::CHEMBL203590::N-((2R,3S)-3-{[5-chloro-2-(1H-tetrazol-1-yl)benzyl]amino}-2-hydroxy-4-phenylbutyl)-4-methoxybenzenesulfonamide::benzenesulfonamide-chlorophenyl hybrid compound 7
SMILES: COc1ccc(cc1)S(=O)(=O)NC[C@@H](O)[C@H](Cc1ccccc1)NCc1cc(Cl)ccc1-n1cnnn1
InChI Key: InChIKey=YDLJMVKRFGITPS-UKILVPOCSA-N
Data: 2 IC50
Activity Spreadsheet -- Enzyme Inhibition Constant Data from BindingDB
Found 2 hits for monomerid = 12589
Trg + Lig
Ki
nM
ΔG°
kcal/mole
IC50
nM
Kd
nM
EC50/IC50
nM
koff
s-1
kon
M-1s-1
pHTemp
°C
Prothrombin
(Homo sapiens (Human))
BDBM12589
((2R,3S)-3-({[5-chloro-2-(1H-1,2,3,4-tetrazol-1-yl)...)
Show SMILES COc1ccc(cc1)S(=O)(=O)NC[C@@H](O)[C@H](Cc1ccccc1)NCc1cc(Cl)ccc1-n1cnnn1 |r|
Show InChI InChI=1S/C25H27ClN6O4S/c1-36-21-8-10-22(11-9-21)37(34,35)29-16-25(33)23(13-18-5-3-2-4-6-18)27-15-19-14-20(26)7-12-24(19)32-17-28-30-31-32/h2-12,14,17,23,25,27,29,33H,13,15-16H2,1H3/t23-,25+/m0/s1
n/an/a 4n/an/an/an/an/an/a
Astex Therapeutics Ltd.
Curated by ChEMBL
Assay Description
Inhibition of thrombin
J Med Chem 51: 3661-80 (2008)
Article DOI: 10.1021/jm8000373
BindingDB Entry DOI: 10.7270/Q2N58M4H
Prothrombin
(Homo sapiens (Human))
BDBM12589
((2R,3S)-3-({[5-chloro-2-(1H-1,2,3,4-tetrazol-1-yl)...)
Show SMILES COc1ccc(cc1)S(=O)(=O)NC[C@@H](O)[C@H](Cc1ccccc1)NCc1cc(Cl)ccc1-n1cnnn1 |r|
Show InChI InChI=1S/C25H27ClN6O4S/c1-36-21-8-10-22(11-9-21)37(34,35)29-16-25(33)23(13-18-5-3-2-4-6-18)27-15-19-14-20(26)7-12-24(19)32-17-28-30-31-32/h2-12,14,17,23,25,27,29,33H,13,15-16H2,1H3/t23-,25+/m0/s1
n/an/a 3.70n/an/an/an/a8.022
Astex
Assay Description
The cleavage of the substrate was followed by monitoring the change in fluorescence at 460 nm (excitation at 365 nm) for 25 min at room temperature o...
J Med Chem 49: 1346-55 (2006)
Article DOI: 10.1021/jm050850v
BindingDB Entry DOI: 10.7270/Q20863J2