BDBM12592 3-({4-[(6-CHLORO-1-BENZOTHIEN-2-YL)SULFONYL]-2-OXOPIPERAZIN-1-YL}METHYL)BENZENECARBOXIMIDAMIDE::3-({4-[(6-chloro-1-benzothiophene-2-)sulfonyl]-2-oxopiperazin-1-yl}methyl)benzene-1-carboximidamide::Ketopiperazine::RPR132747
SMILES: NC(=N)c1cccc(CN2CCN(CC2=O)S(=O)(=O)c2cc3ccc(Cl)cc3s2)c1
InChI Key: InChIKey=PRMSFVUWLBPPLY-UHFFFAOYSA-N
Data: 5 KI
PDB links: 1 PDB ID matches this monomer.
Activity Spreadsheet -- Enzyme Inhibition Constant Data from BindingDB
Found 5 hits for monomerid = 12592
Trg + Lig
Ki
nM
ΔG°
kcal/mole
IC50
nM
Kd
nM
EC50/IC50
nM
koff
s-1
kon
M-1s-1
pHTemp
°C
Coagulation factor X
(Homo sapiens (Human))
BDBM12592
(3-({4-[(6-CHLORO-1-BENZOTHIEN-2-YL)SULFONYL]-2-OXO...)
Show SMILES NC(=N)c1cccc(CN2CCN(CC2=O)S(=O)(=O)c2cc3ccc(Cl)cc3s2)c1
Show InChI InChI=1S/C20H19ClN4O3S2/c21-16-5-4-14-9-19(29-17(14)10-16)30(27,28)25-7-6-24(18(26)12-25)11-13-2-1-3-15(8-13)20(22)23/h1-5,8-10H,6-7,11-12H2,(H3,22,23)
Reactome pathway
4n/an/an/an/an/an/an/an/a
Bristol-Myers Squibb Company
Curated by ChEMBL
Assay Description
Inhibition of factor 10a
J Med Chem 53: 6243-74 (2010)
Article DOI: 10.1021/jm100146h
BindingDB Entry DOI: 10.7270/Q2CR5VBB
3D
3D Structure (crystal)
Coagulation factor X
(Homo sapiens (Human))
BDBM12592
(3-({4-[(6-CHLORO-1-BENZOTHIEN-2-YL)SULFONYL]-2-OXO...)
Show SMILES NC(=N)c1cccc(CN2CCN(CC2=O)S(=O)(=O)c2cc3ccc(Cl)cc3s2)c1
Show InChI InChI=1S/C20H19ClN4O3S2/c21-16-5-4-14-9-19(29-17(14)10-16)30(27,28)25-7-6-24(18(26)12-25)11-13-2-1-3-15(8-13)20(22)23/h1-5,8-10H,6-7,11-12H2,(H3,22,23)
Reactome pathway
18 -10.5n/an/an/an/an/a7.522
Aventis Pharma
Assay Description
The enzyme reactions were initiated by the addition of substrate, and the color developed from the release of p-nitroanilide from each chromogenic su...
J Med Chem 46: 685-90 (2003)
Article DOI: 10.1021/jm0203837
BindingDB Entry DOI: 10.7270/Q2VH5M2S
3D
3D Structure (crystal)
Trypsin
(Bos taurus (bovine))
BDBM12592
(3-({4-[(6-CHLORO-1-BENZOTHIEN-2-YL)SULFONYL]-2-OXO...)
Show SMILES NC(=N)c1cccc(CN2CCN(CC2=O)S(=O)(=O)c2cc3ccc(Cl)cc3s2)c1
Show InChI InChI=1S/C20H19ClN4O3S2/c21-16-5-4-14-9-19(29-17(14)10-16)30(27,28)25-7-6-24(18(26)12-25)11-13-2-1-3-15(8-13)20(22)23/h1-5,8-10H,6-7,11-12H2,(H3,22,23)
>2.90E+3>-7.47n/an/an/an/an/a7.522
Aventis Pharma
Assay Description
The enzyme reactions were initiated by the addition of substrate, and the color developed from the release of p-nitroanilide from each chromogenic su...
J Med Chem 46: 685-90 (2003)
Article DOI: 10.1021/jm0203837
BindingDB Entry DOI: 10.7270/Q2VH5M2S
Prothrombin
(Homo sapiens (Human))
BDBM12592
(3-({4-[(6-CHLORO-1-BENZOTHIEN-2-YL)SULFONYL]-2-OXO...)
Show SMILES NC(=N)c1cccc(CN2CCN(CC2=O)S(=O)(=O)c2cc3ccc(Cl)cc3s2)c1
Show InChI InChI=1S/C20H19ClN4O3S2/c21-16-5-4-14-9-19(29-17(14)10-16)30(27,28)25-7-6-24(18(26)12-25)11-13-2-1-3-15(8-13)20(22)23/h1-5,8-10H,6-7,11-12H2,(H3,22,23)
>4.00E+3>-7.28n/an/an/an/an/a7.522
Aventis Pharma
Assay Description
The enzyme reactions were initiated by the addition of substrate, and the color developed from the release of p-nitroanilide from each chromogenic su...
J Med Chem 46: 685-90 (2003)
Article DOI: 10.1021/jm0203837
BindingDB Entry DOI: 10.7270/Q2VH5M2S
Prothrombin
(Homo sapiens (Human))
BDBM12592
(3-({4-[(6-CHLORO-1-BENZOTHIEN-2-YL)SULFONYL]-2-OXO...)
Show SMILES NC(=N)c1cccc(CN2CCN(CC2=O)S(=O)(=O)c2cc3ccc(Cl)cc3s2)c1
Show InChI InChI=1S/C20H19ClN4O3S2/c21-16-5-4-14-9-19(29-17(14)10-16)30(27,28)25-7-6-24(18(26)12-25)11-13-2-1-3-15(8-13)20(22)23/h1-5,8-10H,6-7,11-12H2,(H3,22,23)
>4.00E+3n/an/an/an/an/an/an/an/a
Bristol-Myers Squibb Company
Curated by ChEMBL
Assay Description
Inhibition of thrombin
J Med Chem 53: 6243-74 (2010)
Article DOI: 10.1021/jm100146h
BindingDB Entry DOI: 10.7270/Q2CR5VBB