null
SMILES: OCCn1c(CN2CCN(CC2=O)S(=O)(=O)c2cc3ccc(Cl)cc3s2)cc2cnccc12
InChI Key: InChIKey=NZNFLUOJACWZKX-UHFFFAOYSA-N
PDB links: 1 PDB ID matches this monomer.
Activity Spreadsheet -- Enzyme Inhibition Constant Data from BindingDB
Found 6 hits for monomerid = 12595
Trg + Lig
Ki
nM
ΔG°
kcal/mole
IC50
nM
Kd
nM
EC50/IC50
nM
koff
s-1
kon
M-1s-1
pHTemp
°C
Coagulation factor X
(Homo sapiens (Human))
BDBM12595
(4-[(6-CHLORO-1-BENZOTHIEN-2-YL)SULFONYL]-1-{[1-(2-...)
Show SMILES OCCn1c(CN2CCN(CC2=O)S(=O)(=O)c2cc3ccc(Cl)cc3s2)cc2cnccc12
Show InChI InChI=1S/C22H21ClN4O4S2/c23-17-2-1-15-10-22(32-20(15)11-17)33(30,31)26-6-5-25(21(29)14-26)13-18-9-16-12-24-4-3-19(16)27(18)7-8-28/h1-4,9-12,28H,5-8,13-14H2
Reactome pathway
3 -11.5n/an/an/an/an/a7.522
Aventis Pharma
Assay Description
The enzyme reactions were initiated by the addition of substrate, and the color developed from the release of p-nitroanilide from each chromogenic su...
J Med Chem 46: 685-90 (2003)
Article DOI: 10.1021/jm0203837
BindingDB Entry DOI: 10.7270/Q2VH5M2S
3D
3D Structure (crystal)
Coagulation factor X
(Homo sapiens (Human))
BDBM12595
(4-[(6-CHLORO-1-BENZOTHIEN-2-YL)SULFONYL]-1-{[1-(2-...)
Show SMILES OCCn1c(CN2CCN(CC2=O)S(=O)(=O)c2cc3ccc(Cl)cc3s2)cc2cnccc12
Show InChI InChI=1S/C22H21ClN4O4S2/c23-17-2-1-15-10-22(32-20(15)11-17)33(30,31)26-6-5-25(21(29)14-26)13-18-9-16-12-24-4-3-19(16)27(18)7-8-28/h1-4,9-12,28H,5-8,13-14H2
Reactome pathway
3n/an/an/an/an/an/an/an/a
Aventis Pharmaceuticals
Curated by ChEMBL
Assay Description
Binding affinity (in vitro) of the compound towards human Coagulation factor X was determined at 10 mg/kg peroral dose
J Med Chem 46: 681-4 (2003)
Article DOI: 10.1021/jm020384z
BindingDB Entry DOI: 10.7270/Q2KW5FDH
3D
3D Structure (crystal)
Serine protease 1
(Bos taurus (bovine))
BDBM12595
(4-[(6-CHLORO-1-BENZOTHIEN-2-YL)SULFONYL]-1-{[1-(2-...)
Show SMILES OCCn1c(CN2CCN(CC2=O)S(=O)(=O)c2cc3ccc(Cl)cc3s2)cc2cnccc12
Show InChI InChI=1S/C22H21ClN4O4S2/c23-17-2-1-15-10-22(32-20(15)11-17)33(30,31)26-6-5-25(21(29)14-26)13-18-9-16-12-24-4-3-19(16)27(18)7-8-28/h1-4,9-12,28H,5-8,13-14H2
>2.90E+3>-7.47n/an/an/an/an/a7.522
Aventis Pharma
Assay Description
The enzyme reactions were initiated by the addition of substrate, and the color developed from the release of p-nitroanilide from each chromogenic su...
J Med Chem 46: 685-90 (2003)
Article DOI: 10.1021/jm0203837
BindingDB Entry DOI: 10.7270/Q2VH5M2S
Serine protease 1
(Homo sapiens (Human))
BDBM12595
(4-[(6-CHLORO-1-BENZOTHIEN-2-YL)SULFONYL]-1-{[1-(2-...)
Show SMILES OCCn1c(CN2CCN(CC2=O)S(=O)(=O)c2cc3ccc(Cl)cc3s2)cc2cnccc12
Show InChI InChI=1S/C22H21ClN4O4S2/c23-17-2-1-15-10-22(32-20(15)11-17)33(30,31)26-6-5-25(21(29)14-26)13-18-9-16-12-24-4-3-19(16)27(18)7-8-28/h1-4,9-12,28H,5-8,13-14H2
Reactome pathway
>2.90E+3n/an/an/an/an/an/an/an/a
Aventis Pharmaceuticals
Curated by ChEMBL
Assay Description
Binding affinity towards trypsin
J Med Chem 46: 681-4 (2003)
Article DOI: 10.1021/jm020384z
BindingDB Entry DOI: 10.7270/Q2KW5FDH
Prothrombin
(Homo sapiens (Human))
BDBM12595
(4-[(6-CHLORO-1-BENZOTHIEN-2-YL)SULFONYL]-1-{[1-(2-...)
Show SMILES OCCn1c(CN2CCN(CC2=O)S(=O)(=O)c2cc3ccc(Cl)cc3s2)cc2cnccc12
Show InChI InChI=1S/C22H21ClN4O4S2/c23-17-2-1-15-10-22(32-20(15)11-17)33(30,31)26-6-5-25(21(29)14-26)13-18-9-16-12-24-4-3-19(16)27(18)7-8-28/h1-4,9-12,28H,5-8,13-14H2
>3.90E+3n/an/an/an/an/an/an/an/a
Aventis Pharmaceuticals
Curated by ChEMBL
Assay Description
Binding affinity towards thrombin
J Med Chem 46: 681-4 (2003)
Article DOI: 10.1021/jm020384z
BindingDB Entry DOI: 10.7270/Q2KW5FDH
Prothrombin
(Homo sapiens (Human))
BDBM12595
(4-[(6-CHLORO-1-BENZOTHIEN-2-YL)SULFONYL]-1-{[1-(2-...)
Show SMILES OCCn1c(CN2CCN(CC2=O)S(=O)(=O)c2cc3ccc(Cl)cc3s2)cc2cnccc12
Show InChI InChI=1S/C22H21ClN4O4S2/c23-17-2-1-15-10-22(32-20(15)11-17)33(30,31)26-6-5-25(21(29)14-26)13-18-9-16-12-24-4-3-19(16)27(18)7-8-28/h1-4,9-12,28H,5-8,13-14H2
>4.00E+3>-7.28n/an/an/an/an/a7.522
Aventis Pharma
Assay Description
The enzyme reactions were initiated by the addition of substrate, and the color developed from the release of p-nitroanilide from each chromogenic su...
J Med Chem 46: 685-90 (2003)
Article DOI: 10.1021/jm0203837
BindingDB Entry DOI: 10.7270/Q2VH5M2S