BDBM12607 2,4-Diamino-5-ketopyrimidine 25::4-({4-amino-5-[(2-methoxyphenyl)carbonyl]pyrimidin-2-yl}amino)-N-ethylpiperidine-1-carboxamide::4-[4-Amino-5-(2-methoxybenzoyl)pyrimidin-2-ylamino]piperidine-1-carboxylic Acid Ethylamide
SMILES: CCNC(=O)N1CCC(CC1)Nc1ncc(C(=O)c2ccccc2OC)c(N)n1
InChI Key: InChIKey=GIFWLUDQYFWBMB-UHFFFAOYSA-N
Data: 3 KI
Activity Spreadsheet -- Enzyme Inhibition Constant Data from BindingDB
Found 3 hits for monomerid = 12607
Trg + Lig
Ki
nM
ΔG°
kcal/mole
IC50
nM
Kd
nM
EC50/IC50
nM
koff
s-1
kon
M-1s-1
pHTemp
°C
Cyclin-dependent kinase 4/G1/S-specific cyclin-D1
(Homo sapiens (Human))
BDBM12607
(2,4-Diamino-5-ketopyrimidine 25 | 4-({4-amino-5-[(...)
Show SMILES CCNC(=O)N1CCC(CC1)Nc1ncc(C(=O)c2ccccc2OC)c(N)n1
Show InChI InChI=1S/C20H26N6O3/c1-3-22-20(28)26-10-8-13(9-11-26)24-19-23-12-15(18(21)25-19)17(27)14-6-4-5-7-16(14)29-2/h4-7,12-13H,3,8-11H2,1-2H3,(H,22,28)(H3,21,23,24,25)
NCI pathway
Reactome pathway
409n/an/an/an/an/an/an/an/a
Hoffmann-La Roche Inc.
Assay Description
Enzymes were assayed with retinoblastoma substrate in 384-well plates containing diluted test compounds. Final ATP concentration was 3x the respectiv...
J Med Chem 49: 6549-60 (2006)
Article DOI: 10.1021/jm0606138
BindingDB Entry DOI: 10.7270/Q2QR4VB2
Cyclin-dependent kinase/G2/mitotic-specific cyclin- 1
(Homo sapiens (Human))
BDBM12607
(2,4-Diamino-5-ketopyrimidine 25 | 4-({4-amino-5-[(...)
Show SMILES CCNC(=O)N1CCC(CC1)Nc1ncc(C(=O)c2ccccc2OC)c(N)n1
Show InChI InChI=1S/C20H26N6O3/c1-3-22-20(28)26-10-8-13(9-11-26)24-19-23-12-15(18(21)25-19)17(27)14-6-4-5-7-16(14)29-2/h4-7,12-13H,3,8-11H2,1-2H3,(H,22,28)(H3,21,23,24,25)
Reactome pathway
1.53E+3n/an/an/an/an/an/an/an/a
Hoffmann-La Roche Inc.
Assay Description
Enzymes were assayed with retinoblastoma substrate in 384-well plates containing diluted test compounds. Final ATP concentration was 3x the respectiv...
J Med Chem 49: 6549-60 (2006)
Article DOI: 10.1021/jm0606138
BindingDB Entry DOI: 10.7270/Q2QR4VB2
Cyclin-dependent kinase 2/G1/S-specific cyclin-E1
(Homo sapiens (Human))
BDBM12607
(2,4-Diamino-5-ketopyrimidine 25 | 4-({4-amino-5-[(...)
Show SMILES CCNC(=O)N1CCC(CC1)Nc1ncc(C(=O)c2ccccc2OC)c(N)n1
Show InChI InChI=1S/C20H26N6O3/c1-3-22-20(28)26-10-8-13(9-11-26)24-19-23-12-15(18(21)25-19)17(27)14-6-4-5-7-16(14)29-2/h4-7,12-13H,3,8-11H2,1-2H3,(H,22,28)(H3,21,23,24,25)
1.76E+3 -8.16n/an/an/an/an/a7.037
Hoffmann-La Roche Inc.
Assay Description
Enzymes were assayed with retinoblastoma substrate in 384-well plates containing diluted test compounds. Final ATP concentration was 3x the respectiv...
J Med Chem 49: 6549-60 (2006)
Article DOI: 10.1021/jm0606138
BindingDB Entry DOI: 10.7270/Q2QR4VB2