BDBM12610 1-[4-({4-amino-5-[(2-methoxyphenyl)carbonyl]pyrimidin-2-yl}amino)piperidin-1-yl]butan-1-one::1-[4-[4-Amino-5-(2-methoxybenzoyl)pyrimidin-2-ylamino]-piperidin-1-yl]butan-1-one::2,4-Diamino-5-ketopyrimidine 28
SMILES: CCCC(=O)N1CCC(CC1)Nc1ncc(C(=O)c2ccccc2OC)c(N)n1
InChI Key: InChIKey=YQGOLKAPGJXEGX-UHFFFAOYSA-N
Data: 3 KI
Activity Spreadsheet -- Enzyme Inhibition Constant Data from BindingDB
Found 3 hits for monomerid = 12610
Trg + Lig
Ki
nM
ΔG°
kcal/mole
IC50
nM
Kd
nM
EC50/IC50
nM
koff
s-1
kon
M-1s-1
pHTemp
°C
Cyclin-dependent kinase 4/G1/S-specific cyclin-D1
(Homo sapiens (Human))
BDBM12610
(1-[4-({4-amino-5-[(2-methoxyphenyl)carbonyl]pyrimi...)
Show SMILES CCCC(=O)N1CCC(CC1)Nc1ncc(C(=O)c2ccccc2OC)c(N)n1
Show InChI InChI=1S/C21H27N5O3/c1-3-6-18(27)26-11-9-14(10-12-26)24-21-23-13-16(20(22)25-21)19(28)15-7-4-5-8-17(15)29-2/h4-5,7-8,13-14H,3,6,9-12H2,1-2H3,(H3,22,23,24,25)
NCI pathway
Reactome pathway
98n/an/an/an/an/an/an/an/a
Hoffmann-La Roche Inc.
Assay Description
Enzymes were assayed with retinoblastoma substrate in 384-well plates containing diluted test compounds. Final ATP concentration was 3x the respectiv...
J Med Chem 49: 6549-60 (2006)
Article DOI: 10.1021/jm0606138
BindingDB Entry DOI: 10.7270/Q2QR4VB2
Cyclin-dependent kinase/G2/mitotic-specific cyclin- 1
(Homo sapiens (Human))
BDBM12610
(1-[4-({4-amino-5-[(2-methoxyphenyl)carbonyl]pyrimi...)
Show SMILES CCCC(=O)N1CCC(CC1)Nc1ncc(C(=O)c2ccccc2OC)c(N)n1
Show InChI InChI=1S/C21H27N5O3/c1-3-6-18(27)26-11-9-14(10-12-26)24-21-23-13-16(20(22)25-21)19(28)15-7-4-5-8-17(15)29-2/h4-5,7-8,13-14H,3,6,9-12H2,1-2H3,(H3,22,23,24,25)
Reactome pathway
278n/an/an/an/an/an/an/an/a
Hoffmann-La Roche Inc.
Assay Description
Enzymes were assayed with retinoblastoma substrate in 384-well plates containing diluted test compounds. Final ATP concentration was 3x the respectiv...
J Med Chem 49: 6549-60 (2006)
Article DOI: 10.1021/jm0606138
BindingDB Entry DOI: 10.7270/Q2QR4VB2
Cyclin-dependent kinase 2/G1/S-specific cyclin-E1
(Homo sapiens (Human))
BDBM12610
(1-[4-({4-amino-5-[(2-methoxyphenyl)carbonyl]pyrimi...)
Show SMILES CCCC(=O)N1CCC(CC1)Nc1ncc(C(=O)c2ccccc2OC)c(N)n1
Show InChI InChI=1S/C21H27N5O3/c1-3-6-18(27)26-11-9-14(10-12-26)24-21-23-13-16(20(22)25-21)19(28)15-7-4-5-8-17(15)29-2/h4-5,7-8,13-14H,3,6,9-12H2,1-2H3,(H3,22,23,24,25)
886 -8.58n/an/an/an/an/a7.037
Hoffmann-La Roche Inc.
Assay Description
Enzymes were assayed with retinoblastoma substrate in 384-well plates containing diluted test compounds. Final ATP concentration was 3x the respectiv...
J Med Chem 49: 6549-60 (2006)
Article DOI: 10.1021/jm0606138
BindingDB Entry DOI: 10.7270/Q2QR4VB2