BDBM126178 US8778957, 76
SMILES: O=C1Nc2ncccc2[C@@]11Cc2cc3ccc(CN4CCNCC4)nc3cc2C1
InChI Key: InChIKey=CCDOKLLKHRMRLO-QHCPKHFHSA-N
Data: 1 KI
Activity Spreadsheet -- Enzyme Inhibition Constant Data from BindingDB
Found 1 hit for monomerid = 126178
Trg + Lig
Ki
nM
ΔG°
kcal/mole
IC50
nM
Kd
nM
EC50/IC50
nM
koff
s-1
kon
M-1s-1
pHTemp
°C
Calcitonin gene-related peptide (CGRP alpha)
(Homo sapiens (Human))
BDBM126178
(US8778957, 76)
Show SMILES O=C1Nc2ncccc2[C@@]11Cc2cc3ccc(CN4CCNCC4)nc3cc2C1 |r|
Show InChI InChI=1S/C23H23N5O/c29-22-23(19-2-1-5-25-21(19)27-22)12-16-10-15-3-4-18(14-28-8-6-24-7-9-28)26-20(15)11-17(16)13-23/h1-5,10-11,24H,6-9,12-14H2,(H,25,27,29)/t23-/m0/s1
Reactome pathway
US Patent
0.730 -12.5n/an/an/an/an/a7.425
Merck Sharp & Dohme Corp.
US Patent
Assay Description
Cells expressing recombinant human CL receptor/RAMP1 were washed with PBS and harvested in harvest buffer containing 50 mM HEPES, 1 mM EDTA and Compl...
US Patent US8778957 (2014)
BindingDB Entry DOI: 10.7270/Q29022G8