BDBM126529 US8778951, 340
SMILES: COC[C@@H](C)N[C@H]1CC[C@@H](CC1)Nc1cc(c(Cl)cn1)-c1ccc(F)c(NCC2(CCOCC2)C#N)n1
InChI Key: InChIKey=FKVVKQVKDBCJMQ-VAMGGRTRSA-N
Data: 1 IC50
Activity Spreadsheet -- Enzyme Inhibition Constant Data from BindingDB
Found 1 hit for monomerid = 126529
Trg + Lig
Ki
nM
ΔG°
kcal/mole
IC50
nM
Kd
nM
EC50/IC50
nM
koff
s-1
kon
M-1s-1
pHTemp
°C
Cyclin-T1
(Homo sapiens (Human))
BDBM126529
(US8778951, 340)
Show SMILES COC[C@@H](C)N[C@H]1CC[C@@H](CC1)Nc1cc(c(Cl)cn1)-c1ccc(F)c(NCC2(CCOCC2)C#N)n1 |r,wU:9.12,wD:6.5,3.3,(7.56,1.68,;6.23,2.45,;4.9,1.68,;3.56,2.45,;3.56,3.99,;2.23,1.68,;.89,2.45,;.89,3.99,;-.44,4.76,;-1.77,3.99,;-1.77,2.45,;-.44,1.68,;-3.11,4.76,;-4.44,3.99,;-4.44,2.45,;-5.77,1.68,;-7.11,2.45,;-8.44,1.68,;-7.11,3.99,;-5.77,4.76,;-5.77,.14,;-7.11,-.63,;-7.11,-2.17,;-5.77,-2.94,;-5.77,-4.48,;-4.44,-2.17,;-3.11,-2.94,;-1.77,-2.17,;-.44,-2.94,;-.44,-4.48,;.89,-5.25,;2.23,-4.48,;2.23,-2.94,;.89,-2.17,;-.44,-1.4,;-.44,.14,;-4.44,-.63,)|
Show InChI InChI=1S/C27H36ClFN6O2/c1-18(15-36-2)33-19-3-5-20(6-4-19)34-25-13-21(22(28)14-31-25)24-8-7-23(29)26(35-24)32-17-27(16-30)9-11-37-12-10-27/h7-8,13-14,18-20,33H,3-6,9-12,15,17H2,1-2H3,(H,31,34)(H,32,35)/t18-,19-,20-/m1/s1
Reactome pathway
US Patent
n/an/a 0.000230n/an/an/an/an/an/a
Novartis AG
US Patent
Assay Description
Cdk9/cyclinT1 is purchased from Millipore, cat #14-685. The final total protein concentration in the assay 4 nM. The 5TAMRA-cdk7tide peptide substrat...
US Patent US8778951 (2014)
BindingDB Entry DOI: 10.7270/Q25B014T