BDBM126538 US8778951, 349
SMILES: COC[C@@H](C)N[C@H]1CC[C@@H](CC1)Nc1cc(c(Cl)cn1)-c1cccc(NCC2(CO)CCOCC2)n1
InChI Key: InChIKey=UXVZTNFUCDUKSB-NJDAHSKKSA-N
Data: 1 IC50
Activity Spreadsheet -- Enzyme Inhibition Constant Data from BindingDB
Found 1 hit for monomerid = 126538
Trg + Lig
Ki
nM
ΔG°
kcal/mole
IC50
nM
Kd
nM
EC50/IC50
nM
koff
s-1
kon
M-1s-1
pHTemp
°C
Cyclin-T1
(Homo sapiens (Human))
BDBM126538
(US8778951, 349)
Show SMILES COC[C@@H](C)N[C@H]1CC[C@@H](CC1)Nc1cc(c(Cl)cn1)-c1cccc(NCC2(CO)CCOCC2)n1 |r,wU:9.12,wD:6.5,3.3,(7.56,1.68,;6.23,2.45,;4.9,1.68,;3.56,2.45,;3.56,3.99,;2.23,1.68,;.89,2.45,;.89,3.99,;-.44,4.76,;-1.77,3.99,;-1.77,2.45,;-.44,1.68,;-3.11,4.76,;-4.44,3.99,;-4.44,2.45,;-5.77,1.68,;-7.11,2.45,;-8.44,1.68,;-7.11,3.99,;-5.77,4.76,;-5.77,.14,;-7.11,-.63,;-7.11,-2.17,;-5.77,-2.94,;-4.44,-2.17,;-3.11,-2.94,;-1.77,-2.17,;-.44,-2.94,;-.44,-1.4,;.89,-.63,;-.44,-4.48,;.89,-5.25,;2.23,-4.48,;2.23,-2.94,;.89,-2.17,;-4.44,-.63,)|
Show InChI InChI=1S/C27H40ClN5O3/c1-19(16-35-2)31-20-6-8-21(9-7-20)32-26-14-22(23(28)15-29-26)24-4-3-5-25(33-24)30-17-27(18-34)10-12-36-13-11-27/h3-5,14-15,19-21,31,34H,6-13,16-18H2,1-2H3,(H,29,32)(H,30,33)/t19-,20-,21-/m1/s1
Reactome pathway
US Patent
n/an/a 0.00100n/an/an/an/an/an/a
Novartis AG
US Patent
Assay Description
Cdk9/cyclinT1 is purchased from Millipore, cat #14-685. The final total protein concentration in the assay 4 nM. The 5TAMRA-cdk7tide peptide substrat...
US Patent US8778951 (2014)
BindingDB Entry DOI: 10.7270/Q25B014T