BDBM126553 US8778951, 364
SMILES: COCCN[C@H]1CC[C@@H](CC1)Nc1cc(c(Cl)cn1)-c1cccc(NCC2(F)CCOCC2)n1
InChI Key: InChIKey=LEYXDMKGAITPJF-WGSAOQKQSA-N
Data: 1 IC50
Activity Spreadsheet -- Enzyme Inhibition Constant Data from BindingDB
Found 1 hit for monomerid = 126553
Trg + Lig
Ki
nM
ΔG°
kcal/mole
IC50
nM
Kd
nM
EC50/IC50
nM
koff
s-1
kon
M-1s-1
pHTemp
°C
Cyclin-T1
(Homo sapiens (Human))
BDBM126553
(US8778951, 364)
Show SMILES COCCN[C@H]1CC[C@@H](CC1)Nc1cc(c(Cl)cn1)-c1cccc(NCC2(F)CCOCC2)n1 |r,wU:8.11,wD:5.4,(8,1.93,;6.67,2.7,;5.33,1.93,;4,2.7,;2.67,1.93,;1.33,2.7,;1.33,4.24,;,5.01,;-1.33,4.24,;-1.33,2.7,;,1.93,;-2.67,5.01,;-4,4.23,;-4,2.69,;-5.33,1.92,;-6.67,2.69,;-8,1.92,;-6.67,4.23,;-5.33,5,;-5.33,.38,;-6.67,-.39,;-6.67,-1.93,;-5.33,-2.7,;-4,-1.93,;-2.67,-2.7,;-1.33,-1.93,;,-2.7,;,-1.16,;,-4.24,;1.33,-5.01,;2.67,-4.24,;2.67,-2.7,;1.33,-1.93,;-4,-.39,)|
Show InChI InChI=1S/C25H35ClFN5O2/c1-33-14-11-28-18-5-7-19(8-6-18)31-24-15-20(21(26)16-29-24)22-3-2-4-23(32-22)30-17-25(27)9-12-34-13-10-25/h2-4,15-16,18-19,28H,5-14,17H2,1H3,(H,29,31)(H,30,32)/t18-,19-
Reactome pathway
US Patent
n/an/a 0.000630n/an/an/an/an/an/a
Novartis AG
US Patent
Assay Description
Cdk9/cyclinT1 is purchased from Millipore, cat #14-685. The final total protein concentration in the assay 4 nM. The 5TAMRA-cdk7tide peptide substrat...
US Patent US8778951 (2014)
BindingDB Entry DOI: 10.7270/Q25B014T