null
SMILES: NC1(CCC1)c1ccc(cc1)-c1nc2-c3ccncc3OCn2c1-c1ccccc1
InChI Key: InChIKey=KLWQEODJBGDVRP-UHFFFAOYSA-N
Activity Spreadsheet -- Enzyme Inhibition Constant Data from BindingDB
Found 2 hits for monomerid = 126593
Trg + Lig
Ki
nM
ΔG°
kcal/mole
IC50
nM
Kd
nM
EC50/IC50
nM
koff
s-1
kon
M-1s-1
pHTemp
°C
RAC-beta serine/threonine-protein kinase
(Homo sapiens (Human))
BDBM126593
(US8772283, 37)
Show SMILES NC1(CCC1)c1ccc(cc1)-c1nc2-c3ccncc3OCn2c1-c1ccccc1
Show InChI InChI=1S/C25H22N4O/c26-25(12-4-13-25)19-9-7-17(8-10-19)22-23(18-5-2-1-3-6-18)29-16-30-21-15-27-14-11-20(21)24(29)28-22/h1-3,5-11,14-15H,4,12-13,16,26H2
US Patent
n/an/a 1.10n/an/an/an/a7.5n/a
Taiho Pharmaceutical Co., Ltd.
US Patent
Assay Description
Preparation of AKT1 and AKT2 and measurement of in vitro inhibitory activity of the above-mentioned compounds against AKT1 and AKT2 kinase activity w...
US Patent US8772283 (2014)
BindingDB Entry DOI: 10.7270/Q21J98F0
RAC-alpha serine/threonine-protein kinase
(Homo sapiens (Human))
BDBM126593
(US8772283, 37)
Show SMILES NC1(CCC1)c1ccc(cc1)-c1nc2-c3ccncc3OCn2c1-c1ccccc1
Show InChI InChI=1S/C25H22N4O/c26-25(12-4-13-25)19-9-7-17(8-10-19)22-23(18-5-2-1-3-6-18)29-16-30-21-15-27-14-11-20(21)24(29)28-22/h1-3,5-11,14-15H,4,12-13,16,26H2
US Patent
n/an/a 5.5n/an/an/an/a7.5n/a
Taiho Pharmaceutical Co., Ltd.
US Patent
Assay Description
Preparation of AKT1 and AKT2 and measurement of in vitro inhibitory activity of the above-mentioned compounds against AKT1 and AKT2 kinase activity w...
US Patent US8772283 (2014)
BindingDB Entry DOI: 10.7270/Q21J98F0