BDBM126603 US8772283, 46
SMILES:
InChI Key: InChIKey=XWLHFAMNURGZPO-UHFFFAOYSA-N
Data: 2 IC50
Activity Spreadsheet -- Enzyme Inhibition Constant Data from BindingDB
Found 2 hits for monomerid = 126603
Trg + Lig
Ki
nM
ΔG°
kcal/mole
IC50
nM
Kd
nM
EC50/IC50
nM
koff
s-1
kon
M-1s-1
pHTemp
°C
Serine/threonine-protein kinase AKT2
(Homo sapiens (Human))
BDBM126603
(US8772283, 46)
Show InChI InChI=1S/C28H24N4O2/c1-27(33)15-28(30,16-27)21-10-8-19(9-11-21)24-25(20-5-3-2-4-6-20)32-17-34-23-12-7-18(14-29)13-22(23)26(32)31-24/h2-13,33H,15-17,30H2,1H3
US Patent
n/an/a 0.970n/an/an/an/a7.5n/a
Taiho Pharmaceutical Co., Ltd.
US Patent
Assay Description
Preparation of AKT1 and AKT2 and measurement of in vitro inhibitory activity of the above-mentioned compounds against AKT1 and AKT2 kinase activity w...
US Patent US8772283 (2014)
BindingDB Entry DOI: 10.7270/Q21J98F0
RAC-alpha serine/threonine-protein kinase
(Homo sapiens (Human))
BDBM126603
(US8772283, 46)
Show InChI InChI=1S/C28H24N4O2/c1-27(33)15-28(30,16-27)21-10-8-19(9-11-21)24-25(20-5-3-2-4-6-20)32-17-34-23-12-7-18(14-29)13-22(23)26(32)31-24/h2-13,33H,15-17,30H2,1H3
US Patent
n/an/a 4.40n/an/an/an/a7.5n/a
Taiho Pharmaceutical Co., Ltd.
US Patent
Assay Description
Preparation of AKT1 and AKT2 and measurement of in vitro inhibitory activity of the above-mentioned compounds against AKT1 and AKT2 kinase activity w...
US Patent US8772283 (2014)
BindingDB Entry DOI: 10.7270/Q21J98F0