BDBM126604 US8772283, 48
SMILES:
InChI Key: InChIKey=INAQLFYULDZTOX-UHFFFAOYSA-N
Data: 2 IC50
Activity Spreadsheet -- Enzyme Inhibition Constant Data from BindingDB
Found 2 hits for monomerid = 126604
Trg + Lig
Ki
nM
ΔG°
kcal/mole
IC50
nM
Kd
nM
EC50/IC50
nM
koff
s-1
kon
M-1s-1
pHTemp
°C
Serine/threonine-protein kinase AKT2
(Homo sapiens (Human))
BDBM126604
(US8772283, 48)
Show InChI InChI=1S/C30H27N5O2/c1-29(36)16-30(31,17-29)22-10-7-19(8-11-22)26-27(20-5-3-2-4-6-20)35-18-37-25-12-9-21(24-13-14-32-34-24)15-23(25)28(35)33-26/h2-15,36H,16-18,31H2,1H3,(H,32,34)
US Patent
n/an/a 0.320n/an/an/an/a7.5n/a
Taiho Pharmaceutical Co., Ltd.
US Patent
Assay Description
Preparation of AKT1 and AKT2 and measurement of in vitro inhibitory activity of the above-mentioned compounds against AKT1 and AKT2 kinase activity w...
US Patent US8772283 (2014)
BindingDB Entry DOI: 10.7270/Q21J98F0
RAC-alpha serine/threonine-protein kinase
(Homo sapiens (Human))
BDBM126604
(US8772283, 48)
Show InChI InChI=1S/C30H27N5O2/c1-29(36)16-30(31,17-29)22-10-7-19(8-11-22)26-27(20-5-3-2-4-6-20)35-18-37-25-12-9-21(24-13-14-32-34-24)15-23(25)28(35)33-26/h2-15,36H,16-18,31H2,1H3,(H,32,34)
US Patent
n/an/a 0.800n/an/an/an/a7.5n/a
Taiho Pharmaceutical Co., Ltd.
US Patent
Assay Description
Preparation of AKT1 and AKT2 and measurement of in vitro inhibitory activity of the above-mentioned compounds against AKT1 and AKT2 kinase activity w...
US Patent US8772283 (2014)
BindingDB Entry DOI: 10.7270/Q21J98F0