BDBM126608 US8772283, 52
SMILES:
InChI Key: InChIKey=GHBYOUKRXQKXBR-UHFFFAOYSA-N
Data: 2 IC50
Activity Spreadsheet -- Enzyme Inhibition Constant Data from BindingDB
Found 2 hits for monomerid = 126608
Trg + Lig
Ki
nM
ΔG°
kcal/mole
IC50
nM
Kd
nM
EC50/IC50
nM
koff
s-1
kon
M-1s-1
pHTemp
°C
Serine/threonine-protein kinase AKT2
(Homo sapiens (Human))
BDBM126608
(US8772283, 52)
Show InChI InChI=1S/C29H28N4O3/c1-28(35)15-29(30,16-28)21-11-8-18(9-12-21)24-25(19-6-4-3-5-7-19)33-17-36-23-13-10-20(27(34)31-2)14-22(23)26(33)32-24/h3-14,35H,15-17,30H2,1-2H3,(H,31,34)
US Patent
n/an/a 0.280n/an/an/an/a7.5n/a
Taiho Pharmaceutical Co., Ltd.
US Patent
Assay Description
Preparation of AKT1 and AKT2 and measurement of in vitro inhibitory activity of the above-mentioned compounds against AKT1 and AKT2 kinase activity w...
US Patent US8772283 (2014)
BindingDB Entry DOI: 10.7270/Q21J98F0
RAC-alpha serine/threonine-protein kinase
(Homo sapiens (Human))
BDBM126608
(US8772283, 52)
Show InChI InChI=1S/C29H28N4O3/c1-28(35)15-29(30,16-28)21-11-8-18(9-12-21)24-25(19-6-4-3-5-7-19)33-17-36-23-13-10-20(27(34)31-2)14-22(23)26(33)32-24/h3-14,35H,15-17,30H2,1-2H3,(H,31,34)
US Patent
n/an/a 1.5n/an/an/an/a7.5n/a
Taiho Pharmaceutical Co., Ltd.
US Patent
Assay Description
Preparation of AKT1 and AKT2 and measurement of in vitro inhibitory activity of the above-mentioned compounds against AKT1 and AKT2 kinase activity w...
US Patent US8772283 (2014)
BindingDB Entry DOI: 10.7270/Q21J98F0