BDBM126611 US8772283, 55
SMILES:
InChI Key: InChIKey=DYWUNBIFOFLAJL-UHFFFAOYSA-N
Data: 2 IC50
Activity Spreadsheet -- Enzyme Inhibition Constant Data from BindingDB
Found 2 hits for monomerid = 126611
Trg + Lig
Ki
nM
ΔG°
kcal/mole
IC50
nM
Kd
nM
EC50/IC50
nM
koff
s-1
kon
M-1s-1
pHTemp
°C
Serine/threonine-protein kinase AKT2
(Homo sapiens (Human))
BDBM126611
(US8772283, 55)
Show InChI InChI=1S/C30H30N4O3/c1-3-32-28(35)21-11-14-24-23(15-21)27-33-25(26(34(27)18-37-24)20-7-5-4-6-8-20)19-9-12-22(13-10-19)30(31)16-29(2,36)17-30/h4-15,36H,3,16-18,31H2,1-2H3,(H,32,35)
US Patent
n/an/a 0.310n/an/an/an/a7.5n/a
Taiho Pharmaceutical Co., Ltd.
US Patent
Assay Description
Preparation of AKT1 and AKT2 and measurement of in vitro inhibitory activity of the above-mentioned compounds against AKT1 and AKT2 kinase activity w...
US Patent US8772283 (2014)
BindingDB Entry DOI: 10.7270/Q21J98F0
RAC-alpha serine/threonine-protein kinase
(Homo sapiens (Human))
BDBM126611
(US8772283, 55)
Show InChI InChI=1S/C30H30N4O3/c1-3-32-28(35)21-11-14-24-23(15-21)27-33-25(26(34(27)18-37-24)20-7-5-4-6-8-20)19-9-12-22(13-10-19)30(31)16-29(2,36)17-30/h4-15,36H,3,16-18,31H2,1-2H3,(H,32,35)
US Patent
n/an/a 1.80n/an/an/an/a7.5n/a
Taiho Pharmaceutical Co., Ltd.
US Patent
Assay Description
Preparation of AKT1 and AKT2 and measurement of in vitro inhibitory activity of the above-mentioned compounds against AKT1 and AKT2 kinase activity w...
US Patent US8772283 (2014)
BindingDB Entry DOI: 10.7270/Q21J98F0