BDBM126656 US8785638, 140
SMILES: CCCC(C(O)=O)c1c(C)nc2sc3CCCCc3c2c1-c1cccc(c1)C(F)(F)F
InChI Key: InChIKey=KDJUVUJFXVXVCW-UHFFFAOYSA-N
Data: 1 IC50
Activity Spreadsheet -- Enzyme Inhibition Constant Data from BindingDB
Found 1 hit for monomerid = 126656
Trg + Lig
Ki
nM
ΔG°
kcal/mole
IC50
nM
Kd
nM
EC50/IC50
nM
koff
s-1
kon
M-1s-1
pHTemp
°C
Gag-Pol polyprotein
(Human immunodeficiency virus type 1 (HIV-1))
BDBM126656
(US8785638, 140)
Show SMILES CCCC(C(O)=O)c1c(C)nc2sc3CCCCc3c2c1-c1cccc(c1)C(F)(F)F
Show InChI InChI=1S/C24H24F3NO2S/c1-3-7-17(23(29)30)19-13(2)28-22-21(16-10-4-5-11-18(16)31-22)20(19)14-8-6-9-15(12-14)24(25,26)27/h6,8-9,12,17H,3-5,7,10-11H2,1-2H3,(H,29,30)
US Patent
n/an/a 1.81E+4n/an/an/an/a7.44
Katholieke Universiteit Leuven
US Patent
Assay Description
The AlphaScreen assay was performed according to the manufacturer's protocol (Perkin Elmer, Benelux). Reactions were performed in 25 ul final volume ...
US Patent US8785638 (2014)
BindingDB Entry DOI: 10.7270/Q2S18167