BDBM126666 US8785638, 150
SMILES: CCCC(C(O)=O)c1c(C)nc2sc3CCCCc3c2c1-c1cccnc1
InChI Key: InChIKey=JZYOIHLHWTXDSP-UHFFFAOYSA-N
Data: 1 IC50
Activity Spreadsheet -- Enzyme Inhibition Constant Data from BindingDB
Found 1 hit for monomerid = 126666
Trg + Lig
Ki
nM
ΔG°
kcal/mole
IC50
nM
Kd
nM
EC50/IC50
nM
koff
s-1
kon
M-1s-1
pHTemp
°C
Gag-Pol polyprotein
(Human immunodeficiency virus type 1 (HIV-1))
BDBM126666
(US8785638, 150)
Show SMILES CCCC(C(O)=O)c1c(C)nc2sc3CCCCc3c2c1-c1cccnc1
Show InChI InChI=1S/C22H24N2O2S/c1-3-7-16(22(25)26)18-13(2)24-21-20(15-9-4-5-10-17(15)27-21)19(18)14-8-6-11-23-12-14/h6,8,11-12,16H,3-5,7,9-10H2,1-2H3,(H,25,26)
US Patent
n/an/a 1.37E+3n/an/an/an/a7.44
Katholieke Universiteit Leuven
US Patent
Assay Description
The AlphaScreen assay was performed according to the manufacturer's protocol (Perkin Elmer, Benelux). Reactions were performed in 25 ul final volume ...
US Patent US8785638 (2014)
BindingDB Entry DOI: 10.7270/Q2S18167