BDBM126675 US8785638, 160
SMILES: CCCC(C(O)=O)c1c(C)nc2sc3CCCCc3c2c1-c1ccc(C)cc1OC
InChI Key: InChIKey=ZHIWDLNGUFACHB-UHFFFAOYSA-N
Data: 1 IC50
Activity Spreadsheet -- Enzyme Inhibition Constant Data from BindingDB
Found 1 hit for monomerid = 126675
Trg + Lig
Ki
nM
ΔG°
kcal/mole
IC50
nM
Kd
nM
EC50/IC50
nM
koff
s-1
kon
M-1s-1
pHTemp
°C
Protease
(Human immunodeficiency virus type 1 (HIV-1))
BDBM126675
(US8785638, 160)
Show SMILES CCCC(C(O)=O)c1c(C)nc2sc3CCCCc3c2c1-c1ccc(C)cc1OC |(4.26,2.31,;4.26,.77,;2.93,,;2.93,-1.54,;4.26,-2.31,;5.6,-1.54,;4.26,-3.85,;1.6,-2.31,;1.6,-3.85,;2.93,-4.62,;.26,-4.62,;-1.07,-3.85,;-2.53,-4.33,;-3.44,-3.08,;-4.97,-2.92,;-5.6,-1.51,;-4.69,-.27,;-3.16,-.43,;-2.53,-1.83,;-1.07,-2.31,;.26,-1.54,;.26,,;1.6,.77,;1.6,2.31,;.26,3.08,;.26,4.62,;-1.07,2.31,;-1.07,.77,;-2.4,,;-3.74,.77,)|
Show InChI InChI=1S/C25H29NO3S/c1-5-8-18(25(27)28)21-15(3)26-24-23(17-9-6-7-10-20(17)30-24)22(21)16-12-11-14(2)13-19(16)29-4/h11-13,18H,5-10H2,1-4H3,(H,27,28)
US Patent
n/an/a 1.77E+4n/an/an/an/a7.44
Katholieke Universiteit Leuven
US Patent
Assay Description
The AlphaScreen assay was performed according to the manufacturer's protocol (Perkin Elmer, Benelux). Reactions were performed in 25 ul final volume ...
US Patent US8785638 (2014)
BindingDB Entry DOI: 10.7270/Q2S18167