null
SMILES: CCCC(C(O)=O)c1c(C)nc2sc3CN(Cc4ccccc4)CCc3c2c1-c1ccc(C)cc1
InChI Key: InChIKey=YTAYGQUCXMWKDX-UHFFFAOYSA-N
Activity Spreadsheet -- Enzyme Inhibition Constant Data from BindingDB
Found 1 hit for monomerid = 126678
Trg + Lig
Ki
nM
ΔG°
kcal/mole
IC50
nM
Kd
nM
EC50/IC50
nM
koff
s-1
kon
M-1s-1
pHTemp
°C
Gag-Pol polyprotein
(Human immunodeficiency virus type 1 (HIV-1))
BDBM126678
(US8785638, 163)
Show SMILES CCCC(C(O)=O)c1c(C)nc2sc3CN(Cc4ccccc4)CCc3c2c1-c1ccc(C)cc1
Show InChI InChI=1S/C30H32N2O2S/c1-4-8-24(30(33)34)26-20(3)31-29-28(27(26)22-13-11-19(2)12-14-22)23-15-16-32(18-25(23)35-29)17-21-9-6-5-7-10-21/h5-7,9-14,24H,4,8,15-18H2,1-3H3,(H,33,34)
US Patent
n/an/a 4.50E+3n/an/an/an/a7.44
Katholieke Universiteit Leuven
US Patent
Assay Description
The AlphaScreen assay was performed according to the manufacturer's protocol (Perkin Elmer, Benelux). Reactions were performed in 25 ul final volume ...
US Patent US8785638 (2014)
BindingDB Entry DOI: 10.7270/Q2S18167