BDBM126684 US8785638, 173
SMILES: Cc1nc2sc3CCCCc3c2c(-c2cccnc2)c1C(OC(C)(C)C)C(O)=O
InChI Key: InChIKey=RVICJNQHLPVBRH-UHFFFAOYSA-N
Data: 1 IC50
Activity Spreadsheet -- Enzyme Inhibition Constant Data from BindingDB
Found 1 hit for monomerid = 126684
Trg + Lig
Ki
nM
ΔG°
kcal/mole
IC50
nM
Kd
nM
EC50/IC50
nM
koff
s-1
kon
M-1s-1
pHTemp
°C
Protease
(Human immunodeficiency virus type 1 (HIV-1))
BDBM126684
(US8785638, 173)
Show SMILES Cc1nc2sc3CCCCc3c2c(-c2cccnc2)c1C(OC(C)(C)C)C(O)=O
Show InChI InChI=1S/C23H26N2O3S/c1-13-17(20(22(26)27)28-23(2,3)4)18(14-8-7-11-24-12-14)19-15-9-5-6-10-16(15)29-21(19)25-13/h7-8,11-12,20H,5-6,9-10H2,1-4H3,(H,26,27)
US Patent
n/an/a 5.90E+3n/an/an/an/a7.44
Katholieke Universiteit Leuven
US Patent
Assay Description
The AlphaScreen assay was performed according to the manufacturer's protocol (Perkin Elmer, Benelux). Reactions were performed in 25 ul final volume ...
US Patent US8785638 (2014)
BindingDB Entry DOI: 10.7270/Q2S18167