BDBM126685 US8785638, 175
SMILES: CCCC(c1nnn[nH]1)c1c(C)nc2sc3CCCCc3c2c1-c1ccc(C)cc1
InChI Key: InChIKey=FZEFPXNBYPTJOY-UHFFFAOYSA-N
Data: 1 IC50
Activity Spreadsheet -- Enzyme Inhibition Constant Data from BindingDB
Found 1 hit for monomerid = 126685
Trg + Lig
Ki
nM
ΔG°
kcal/mole
IC50
nM
Kd
nM
EC50/IC50
nM
koff
s-1
kon
M-1s-1
pHTemp
°C
Protease
(Human immunodeficiency virus type 1 (HIV-1))
BDBM126685
(US8785638, 175)
Show SMILES CCCC(c1nnn[nH]1)c1c(C)nc2sc3CCCCc3c2c1-c1ccc(C)cc1
Show InChI InChI=1S/C24H27N5S/c1-4-7-18(23-26-28-29-27-23)20-15(3)25-24-22(17-8-5-6-9-19(17)30-24)21(20)16-12-10-14(2)11-13-16/h10-13,18H,4-9H2,1-3H3,(H,26,27,28,29)
US Patent
n/an/a<1.00E+3n/an/an/an/a7.44
Katholieke Universiteit Leuven
US Patent
Assay Description
The AlphaScreen assay was performed according to the manufacturer's protocol (Perkin Elmer, Benelux). Reactions were performed in 25 ul final volume ...
US Patent US8785638 (2014)
BindingDB Entry DOI: 10.7270/Q2S18167