BDBM126737 US8785489, N-[(2-cyanopyridin-4-yl)methyl]-5-methyl-4-[2-(3-methyl-1,2,4-oxadiazol-5-yl)-1H-indol-5-yl]-1H-imidazole-2-carboxamide
SMILES: Cc1noc(n1)-c1cc2cc(ccc2[nH]1)-c1nc([nH]c1C)C(=O)NCc1ccnc(c1)C#N
InChI Key: InChIKey=FEWRWTWNQVIGQY-UHFFFAOYSA-N
Data: 1 IC50
Activity Spreadsheet -- Enzyme Inhibition Constant Data from BindingDB
Found 1 hit for monomerid = 126737
Trg + Lig
Ki
nM
ΔG°
kcal/mole
IC50
nM
Kd
nM
EC50/IC50
nM
koff
s-1
kon
M-1s-1
pHTemp
°C
Collagenase 3
(Mus musculus (Mouse))
BDBM126737
(US8785489, N-[(2-cyanopyridin-4-yl)methyl]-5-methy...)
Show SMILES Cc1noc(n1)-c1cc2cc(ccc2[nH]1)-c1nc([nH]c1C)C(=O)NCc1ccnc(c1)C#N
Show InChI InChI=1S/C23H18N8O2/c1-12-20(30-21(27-12)22(32)26-11-14-5-6-25-17(7-14)10-24)15-3-4-18-16(8-15)9-19(29-18)23-28-13(2)31-33-23/h3-9,29H,11H2,1-2H3,(H,26,32)(H,27,30)
Reactome pathway
US Patent
n/an/a 0.950n/an/an/an/an/an/a
Boehringer Ingelheim International GmbH
US Patent
Assay Description
The EnzoLyte 520 Generic MMP Assay Kit (AnaSpec Inc.) can detect the activity of several MMPs including MMP-1, 2, 3, 7, 8, 9, 13, and 14. This kit us...
US Patent US8785489 (2014)
BindingDB Entry DOI: 10.7270/Q24B300F