BDBM127103 US8791272, 1.14
SMILES: Cc1nn(Cc2ccc(NC(=O)\C=C\c3ccc(Cl)cc3)cc2)c(C)c1CC(O)=O
InChI Key: InChIKey=NWBKXAUKDQVTDY-KPKJPENVSA-N
Data: 1 KI
Activity Spreadsheet -- Enzyme Inhibition Constant Data from BindingDB
Found 1 hit for monomerid = 127103
Trg + Lig
Ki
nM
ΔG°
kcal/mole
IC50
nM
Kd
nM
EC50/IC50
nM
koff
s-1
kon
M-1s-1
pHTemp
°C
G protein-coupled receptor 44
(Homo sapiens (Human))
BDBM127103
(US8791272, 1.14)
Show SMILES Cc1nn(Cc2ccc(NC(=O)\C=C\c3ccc(Cl)cc3)cc2)c(C)c1CC(O)=O
Show InChI InChI=1S/C23H22ClN3O3/c1-15-21(13-23(29)30)16(2)27(26-15)14-18-5-10-20(11-6-18)25-22(28)12-7-17-3-8-19(24)9-4-17/h3-12H,13-14H2,1-2H3,(H,25,28)(H,29,30)/b12-7+
Reactome pathway
US Patent
1.10n/an/an/an/an/an/a7.4n/a
Boehringer Ingelheim International GmbH
US Patent
Assay Description
The CRTH2 receptor binding assay is performed in a scintillation proximity assay (SPA) format with the radioligand [3H]-PGD2 (Perkin Elmer, NET616000...
US Patent US8791272 (2014)
BindingDB Entry DOI: 10.7270/Q2GH9GNV