BDBM127104 US8791272, 1.15
SMILES: Cc1nn(Cc2ccc(NC(=O)c3ccc(cc3)C(C)(C)C)cc2)c(C)c1CC(O)=O
InChI Key: InChIKey=RYZXAZCUPKWZTP-UHFFFAOYSA-N
Data: 1 KI
Activity Spreadsheet -- Enzyme Inhibition Constant Data from BindingDB
Found 1 hit for monomerid = 127104
Trg + Lig
Ki
nM
ΔG°
kcal/mole
IC50
nM
Kd
nM
EC50/IC50
nM
koff
s-1
kon
M-1s-1
pHTemp
°C
G protein-coupled receptor 44
(Homo sapiens (Human))
BDBM127104
(US8791272, 1.15)
Show SMILES Cc1nn(Cc2ccc(NC(=O)c3ccc(cc3)C(C)(C)C)cc2)c(C)c1CC(O)=O
Show InChI InChI=1S/C25H29N3O3/c1-16-22(14-23(29)30)17(2)28(27-16)15-18-6-12-21(13-7-18)26-24(31)19-8-10-20(11-9-19)25(3,4)5/h6-13H,14-15H2,1-5H3,(H,26,31)(H,29,30)
Reactome pathway
US Patent
0.200n/an/an/an/an/an/a7.4n/a
Boehringer Ingelheim International GmbH
US Patent
Assay Description
The CRTH2 receptor binding assay is performed in a scintillation proximity assay (SPA) format with the radioligand [3H]-PGD2 (Perkin Elmer, NET616000...
US Patent US8791272 (2014)
BindingDB Entry DOI: 10.7270/Q2GH9GNV