BDBM12712 2-{4-[3-cyano-1-(4-methoxyphenyl)-7-oxo-1H,6H,7H-pyrazolo[4,3-d]pyrimidin-6-yl]phenyl}benzene-1-sulfonamide::pyrazolo[4,3-d]pyrimidinone 24
SMILES: COc1ccc(cc1)-n1nc(C#N)c2ncn(-c3ccc(cc3)-c3ccccc3S(N)(=O)=O)c(=O)c12
InChI Key: InChIKey=PZLTVVGYKMLOSY-UHFFFAOYSA-N
Data: 1 KI
Activity Spreadsheet -- Enzyme Inhibition Constant Data from BindingDB
Found 1 hit for monomerid = 12712
Trg + Lig
Ki
nM
ΔG°
kcal/mole
IC50
nM
Kd
nM
EC50/IC50
nM
koff
s-1
kon
M-1s-1
pHTemp
°C
Coagulation factor X
(Homo sapiens (Human))
BDBM12712
(2-{4-[3-cyano-1-(4-methoxyphenyl)-7-oxo-1H,6H,7H-p...)
Show SMILES COc1ccc(cc1)-n1nc(C#N)c2ncn(-c3ccc(cc3)-c3ccccc3S(N)(=O)=O)c(=O)c12
Show InChI InChI=1S/C25H18N6O4S/c1-35-19-12-10-18(11-13-19)31-24-23(21(14-26)29-31)28-15-30(25(24)32)17-8-6-16(7-9-17)20-4-2-3-5-22(20)36(27,33)34/h2-13,15H,1H3,(H2,27,33,34)
Reactome pathway
1.90 -11.8n/an/an/an/an/a7.022
Bristol-Myers Squibb Company
Assay Description
Ki values were obtained from human purified enzyme. All assays were run in microtiter plates. Plates were read for 30 min at 405 nm. Rates were deter...
Bioorg Med Chem Lett 16: 3755-60 (2006)
Article DOI: 10.1016/j.bmcl.2006.04.044
BindingDB Entry DOI: 10.7270/Q2319T41