BDBM127166 US8791272, 2.42
SMILES: CCCc1nn(Cc2ccc(NC(=O)c3ccc4ccccc4c3)cc2)c(C(C)C)c1CC(O)=O
InChI Key: InChIKey=USBAONCQAXYXKB-UHFFFAOYSA-N
Data: 1 KI
Activity Spreadsheet -- Enzyme Inhibition Constant Data from BindingDB
Found 1 hit for monomerid = 127166
Trg + Lig
Ki
nM
ΔG°
kcal/mole
IC50
nM
Kd
nM
EC50/IC50
nM
koff
s-1
kon
M-1s-1
pHTemp
°C
G protein-coupled receptor 44
(Homo sapiens (Human))
BDBM127166
(US8791272, 2.42)
Show SMILES CCCc1nn(Cc2ccc(NC(=O)c3ccc4ccccc4c3)cc2)c(C(C)C)c1CC(O)=O
Show InChI InChI=1S/C29H31N3O3/c1-4-7-26-25(17-27(33)34)28(19(2)3)32(31-26)18-20-10-14-24(15-11-20)30-29(35)23-13-12-21-8-5-6-9-22(21)16-23/h5-6,8-16,19H,4,7,17-18H2,1-3H3,(H,30,35)(H,33,34)
Reactome pathway
US Patent
0.100n/an/an/an/an/an/a7.4n/a
Boehringer Ingelheim International GmbH
US Patent
Assay Description
The CRTH2 receptor binding assay is performed in a scintillation proximity assay (SPA) format with the radioligand [3H]-PGD2 (Perkin Elmer, NET616000...
US Patent US8791272 (2014)
BindingDB Entry DOI: 10.7270/Q2GH9GNV