BDBM127210 US8791272, 7.6
SMILES: Cc1nn(Cc2ccc(NC(=O)c3ccc(Cl)cc3)cc2Cl)c(C)c1CC(O)=O
InChI Key: InChIKey=MZITWGKIBAIOJY-UHFFFAOYSA-N
Data: 1 KI
Activity Spreadsheet -- Enzyme Inhibition Constant Data from BindingDB
Found 1 hit for monomerid = 127210
Trg + Lig
Ki
nM
ΔG°
kcal/mole
IC50
nM
Kd
nM
EC50/IC50
nM
koff
s-1
kon
M-1s-1
pHTemp
°C
G protein-coupled receptor 44
(Homo sapiens (Human))
BDBM127210
(US8791272, 7.6)
Show SMILES Cc1nn(Cc2ccc(NC(=O)c3ccc(Cl)cc3)cc2Cl)c(C)c1CC(O)=O
Show InChI InChI=1S/C21H19Cl2N3O3/c1-12-18(10-20(27)28)13(2)26(25-12)11-15-5-8-17(9-19(15)23)24-21(29)14-3-6-16(22)7-4-14/h3-9H,10-11H2,1-2H3,(H,24,29)(H,27,28)
Reactome pathway
US Patent
1.20n/an/an/an/an/an/a7.4n/a
Boehringer Ingelheim International GmbH
US Patent
Assay Description
The CRTH2 receptor binding assay is performed in a scintillation proximity assay (SPA) format with the radioligand [3H]-PGD2 (Perkin Elmer, NET616000...
US Patent US8791272 (2014)
BindingDB Entry DOI: 10.7270/Q2GH9GNV