BDBM127212 US8791272, 7.8
SMILES: Cc1nn(Cc2ccc(NC(=O)c3ccc(cc3)C(F)(F)F)cc2Cl)c(C)c1CC(O)=O
InChI Key: InChIKey=SUXCLZDLHZTXGD-UHFFFAOYSA-N
Data: 1 KI
Activity Spreadsheet -- Enzyme Inhibition Constant Data from BindingDB
Found 1 hit for monomerid = 127212
Trg + Lig
Ki
nM
ΔG°
kcal/mole
IC50
nM
Kd
nM
EC50/IC50
nM
koff
s-1
kon
M-1s-1
pHTemp
°C
G protein-coupled receptor 44
(Homo sapiens (Human))
BDBM127212
(US8791272, 7.8)
Show SMILES Cc1nn(Cc2ccc(NC(=O)c3ccc(cc3)C(F)(F)F)cc2Cl)c(C)c1CC(O)=O
Show InChI InChI=1S/C22H19ClF3N3O3/c1-12-18(10-20(30)31)13(2)29(28-12)11-15-5-8-17(9-19(15)23)27-21(32)14-3-6-16(7-4-14)22(24,25)26/h3-9H,10-11H2,1-2H3,(H,27,32)(H,30,31)
Reactome pathway
US Patent
0.800n/an/an/an/an/an/a7.4n/a
Boehringer Ingelheim International GmbH
US Patent
Assay Description
The CRTH2 receptor binding assay is performed in a scintillation proximity assay (SPA) format with the radioligand [3H]-PGD2 (Perkin Elmer, NET616000...
US Patent US8791272 (2014)
BindingDB Entry DOI: 10.7270/Q2GH9GNV