BDBM127219 US8791272, 7.15
SMILES: Cc1nn(Cc2ccc(NC(=O)c3ccc(Cl)c(Cl)c3)cc2Cl)c(C)c1CC(O)=O
InChI Key: InChIKey=SGUBOESPNYFZGG-UHFFFAOYSA-N
Data: 1 KI
Activity Spreadsheet -- Enzyme Inhibition Constant Data from BindingDB
Found 1 hit for monomerid = 127219
Trg + Lig
Ki
nM
ΔG°
kcal/mole
IC50
nM
Kd
nM
EC50/IC50
nM
koff
s-1
kon
M-1s-1
pHTemp
°C
G protein-coupled receptor 44
(Homo sapiens (Human))
BDBM127219
(US8791272, 7.15)
Show SMILES Cc1nn(Cc2ccc(NC(=O)c3ccc(Cl)c(Cl)c3)cc2Cl)c(C)c1CC(O)=O
Show InChI InChI=1S/C21H18Cl3N3O3/c1-11-16(9-20(28)29)12(2)27(26-11)10-14-3-5-15(8-18(14)23)25-21(30)13-4-6-17(22)19(24)7-13/h3-8H,9-10H2,1-2H3,(H,25,30)(H,28,29)
Reactome pathway
US Patent
0.600n/an/an/an/an/an/a7.4n/a
Boehringer Ingelheim International GmbH
US Patent
Assay Description
The CRTH2 receptor binding assay is performed in a scintillation proximity assay (SPA) format with the radioligand [3H]-PGD2 (Perkin Elmer, NET616000...
US Patent US8791272 (2014)
BindingDB Entry DOI: 10.7270/Q2GH9GNV