BDBM127422 US8791131, 196
SMILES: CNC(=O)N1CCC(CC1)n1c2c(cnc3ccc(nc23)-c2ccc(nc2)N(C)C)n(C)c1=O
InChI Key: InChIKey=GEFIJVBUAHDDEM-UHFFFAOYSA-N
Data: 2 KI
Activity Spreadsheet -- Enzyme Inhibition Constant Data from BindingDB
Found 2 hits for monomerid = 127422
Trg + Lig
Ki
nM
ΔG°
kcal/mole
IC50
nM
Kd
nM
EC50/IC50
nM
koff
s-1
kon
M-1s-1
pHTemp
°C
Phosphatidylinositol 4,5-bisphosphate 3-kinase catalytic subunit alpha isoform
(Homo sapiens (Human))
BDBM127422
(US8791131, 196)
Show SMILES CNC(=O)N1CCC(CC1)n1c2c(cnc3ccc(nc23)-c2ccc(nc2)N(C)C)n(C)c1=O
Show InChI InChI=1S/C24H28N8O2/c1-25-23(33)31-11-9-16(10-12-31)32-22-19(30(4)24(32)34)14-26-18-7-6-17(28-21(18)22)15-5-8-20(27-13-15)29(2)3/h5-8,13-14,16H,9-12H2,1-4H3,(H,25,33)
NCI pathway
Reactome pathway
US Patent
0.760 -12.4n/an/an/an/an/a7.425
Pfizer Inc.
US Patent
Assay Description
Compounds of the present invention were evaluated for potency against PI3-Kalpha using an in vitro kinase assay. PI3-Kalpha activity is measured in v...
US Patent US8791131 (2014)
BindingDB Entry DOI: 10.7270/Q23B5XV8
Serine/threonine-protein kinase mTOR
(Homo sapiens (Human))
BDBM127422
(US8791131, 196)
Show SMILES CNC(=O)N1CCC(CC1)n1c2c(cnc3ccc(nc23)-c2ccc(nc2)N(C)C)n(C)c1=O
Show InChI InChI=1S/C24H28N8O2/c1-25-23(33)31-11-9-16(10-12-31)32-22-19(30(4)24(32)34)14-26-18-7-6-17(28-21(18)22)15-5-8-20(27-13-15)29(2)3/h5-8,13-14,16H,9-12H2,1-4H3,(H,25,33)
NCI pathway
Reactome pathway
US Patent
3.01 -11.6n/an/an/an/an/a7.525
Pfizer Inc.
US Patent
Assay Description
Compounds of the present invention were evaluated for potency against mTOR using an in vitro kinase assay. mTOR activity is measured in vitro by dete...
US Patent US8791131 (2014)
BindingDB Entry DOI: 10.7270/Q23B5XV8