BDBM12762 N-[4-(5-amino-1H-1,3-benzodiazol-1-yl)-2-fluorophenyl]-1-(3-carbamimidoylphenyl)-3-(trifluoromethyl)-1H-pyrazole-5-carboxamide::pyrazole analog 3k
SMILES: NC(=N)c1cccc(c1)-n1nc(cc1C(=O)Nc1ccc(cc1F)-n1cnc2cc(N)ccc12)C(F)(F)F
InChI Key: InChIKey=SZCUDERAYZVADS-UHFFFAOYSA-N
Data: 2 KI
PDB links: 1 PDB ID contains inhibitors having a similarity of 90% to this monomer.
Activity Spreadsheet -- Enzyme Inhibition Constant Data from BindingDB
Found 2 hits for monomerid = 12762
Trg + Lig
Ki
nM
ΔG°
kcal/mole
IC50
nM
Kd
nM
EC50/IC50
nM
koff
s-1
kon
M-1s-1
pHTemp
°C
Coagulation factor X
(Homo sapiens (Human))
BDBM12762
(N-[4-(5-amino-1H-1,3-benzodiazol-1-yl)-2-fluorophe...)
Show SMILES NC(=N)c1cccc(c1)-n1nc(cc1C(=O)Nc1ccc(cc1F)-n1cnc2cc(N)ccc12)C(F)(F)F
Show InChI InChI=1S/C25H18F4N8O/c26-17-10-15(36-12-33-19-9-14(30)4-7-20(19)36)5-6-18(17)34-24(38)21-11-22(25(27,28)29)35-37(21)16-3-1-2-13(8-16)23(31)32/h1-12H,30H2,(H3,31,32)(H,34,38)
Reactome pathway
0.120 -13.4n/an/an/an/an/a7.022
Bristol-Myers Squibb Company
Assay Description
Ki values were obtained from human purified enzyme. All assays were run in microtiter plates. Plates were read for 30 min at 405 nm. Rates were deter...
Bioorg Med Chem Lett 14: 5263-7 (2004)
Article DOI: 10.1016/j.bmcl.2004.08.034
BindingDB Entry DOI: 10.7270/Q2TH8JX0
Coagulation factor IX
(Homo sapiens (Human))
BDBM12762
(N-[4-(5-amino-1H-1,3-benzodiazol-1-yl)-2-fluorophe...)
Show SMILES NC(=N)c1cccc(c1)-n1nc(cc1C(=O)Nc1ccc(cc1F)-n1cnc2cc(N)ccc12)C(F)(F)F
Show InChI InChI=1S/C25H18F4N8O/c26-17-10-15(36-12-33-19-9-14(30)4-7-20(19)36)5-6-18(17)34-24(38)21-11-22(25(27,28)29)35-37(21)16-3-1-2-13(8-16)23(31)32/h1-12H,30H2,(H3,31,32)(H,34,38)
Reactome pathway
11n/an/an/an/an/an/an/an/a
Bristol-Myers Squibb Company
Assay Description
Ki values were obtained from human purified enzyme. All assays were run in microtiter plates. Plates were read for 30 min at 405 nm. Rates were deter...
Bioorg Med Chem Lett 14: 5263-7 (2004)
Article DOI: 10.1016/j.bmcl.2004.08.034
BindingDB Entry DOI: 10.7270/Q2TH8JX0