BDBM12794 5-amidinoindole 28::N-[4-(1H-1,3-benzodiazol-1-yl)phenyl]-3-(5-carbamimidoyl-1H-indol-3-yl)-4-phenylbutanamide
SMILES: NC(=N)c1ccc2[nH]cc(C(CC(=O)Nc3ccc(cc3)-n3cnc4ccccc34)Cc3ccccc3)c2c1
InChI Key: InChIKey=GIJAFZZBRFHAFR-UHFFFAOYSA-N
Data: 2 KI
Activity Spreadsheet -- Enzyme Inhibition Constant Data from BindingDB
Found 2 hits for monomerid = 12794
Trg + Lig
Ki
nM
ΔG°
kcal/mole
IC50
nM
Kd
nM
EC50/IC50
nM
koff
s-1
kon
M-1s-1
pHTemp
°C
Coagulation factor X
(Homo sapiens (Human))
BDBM12794
(5-amidinoindole 28 | N-[4-(1H-1,3-benzodiazol-1-yl...)
Show SMILES NC(=N)c1ccc2[nH]cc(C(CC(=O)Nc3ccc(cc3)-n3cnc4ccccc34)Cc3ccccc3)c2c1
Show InChI InChI=1S/C32H28N6O/c33-32(34)22-10-15-28-26(17-22)27(19-35-28)23(16-21-6-2-1-3-7-21)18-31(39)37-24-11-13-25(14-12-24)38-20-36-29-8-4-5-9-30(29)38/h1-15,17,19-20,23,35H,16,18H2,(H3,33,34)(H,37,39)
Reactome pathway
36 -10.0n/an/an/an/an/a7.022
Bristol-Myers Squibb Company
Assay Description
Ki values were obtained from human purified enzyme. All assays were run in microtiter plates. Plates were read for 30 min at 405 nm. Rates were deter...
Bioorg Med Chem Lett 14: 5269-73 (2004)
Article DOI: 10.1016/j.bmcl.2004.08.037
BindingDB Entry DOI: 10.7270/Q2PR7T6P
Coagulation factor IX
(Homo sapiens (Human))
BDBM12794
(5-amidinoindole 28 | N-[4-(1H-1,3-benzodiazol-1-yl...)
Show SMILES NC(=N)c1ccc2[nH]cc(C(CC(=O)Nc3ccc(cc3)-n3cnc4ccccc34)Cc3ccccc3)c2c1
Show InChI InChI=1S/C32H28N6O/c33-32(34)22-10-15-28-26(17-22)27(19-35-28)23(16-21-6-2-1-3-7-21)18-31(39)37-24-11-13-25(14-12-24)38-20-36-29-8-4-5-9-30(29)38/h1-15,17,19-20,23,35H,16,18H2,(H3,33,34)(H,37,39)
Reactome pathway
250n/an/an/an/an/an/an/an/a
Bristol-Myers Squibb Company
Assay Description
Ki values were obtained from human purified enzyme. All assays were run in microtiter plates. Plates were read for 30 min at 405 nm. Rates were deter...
Bioorg Med Chem Lett 14: 5269-73 (2004)
Article DOI: 10.1016/j.bmcl.2004.08.037
BindingDB Entry DOI: 10.7270/Q2PR7T6P