BDBM127969 US8796310, 13B
SMILES: Nc1cc(Nc2cc(ccn2)C(F)(F)F)nc(c1)-c1cnc(s1)[C@@]1(O)CCCc2cc(ccc12)C(O)=O
InChI Key: InChIKey=NFMSEOQFJLOMGS-XMMPIXPASA-N
Data: 1 IC50
Activity Spreadsheet -- Enzyme Inhibition Constant Data from BindingDB
Found 1 hit for monomerid = 127969
Trg + Lig
Ki
nM
ΔG°
kcal/mole
IC50
nM
Kd
nM
EC50/IC50
nM
koff
s-1
kon
M-1s-1
pHTemp
°C
Tyrosine-protein kinase SYK
(Homo sapiens (Human))
BDBM127969
(US8796310, 13B)
Show SMILES Nc1cc(Nc2cc(ccn2)C(F)(F)F)nc(c1)-c1cnc(s1)[C@@]1(O)CCCc2cc(ccc12)C(O)=O
Show InChI InChI=1S/C25H20F3N5O3S/c26-25(27,28)15-5-7-30-20(9-15)33-21-11-16(29)10-18(32-21)19-12-31-23(37-19)24(36)6-1-2-13-8-14(22(34)35)3-4-17(13)24/h3-5,7-12,36H,1-2,6H2,(H,34,35)(H3,29,30,32,33)/t24-/m1/s1
NCI pathway
Reactome pathway
US Patent
n/an/a<0.5n/an/an/an/a7.5n/a
Merck Sharp & Dohme Corp.
US Patent
Assay Description
A recombinant GST-hSyk fusion protein was used to measure potency of compounds to inhibit human Syk activity. The recombinant human GST-Syk (Cama Bio...
US Patent US8796310 (2014)
BindingDB Entry DOI: 10.7270/Q29W0D61