BDBM128001 US8796310, 24
SMILES: Cc1cc(Nc2cc(ccn2)C(F)(F)F)nc(c1)-c1cnc(s1)[C@@]1(O)CCCc2cc(ccc12)P(O)(O)=O
InChI Key: InChIKey=PZKZIBJVXYPHOW-XMMPIXPASA-N
Data: 1 IC50
Activity Spreadsheet -- Enzyme Inhibition Constant Data from BindingDB
Found 1 hit for monomerid = 128001
Trg + Lig
Ki
nM
ΔG°
kcal/mole
IC50
nM
Kd
nM
EC50/IC50
nM
koff
s-1
kon
M-1s-1
pHTemp
°C
Tyrosine-protein kinase SYK
(Homo sapiens (Human))
BDBM128001
(US8796310, 24)
Show SMILES Cc1cc(Nc2cc(ccn2)C(F)(F)F)nc(c1)-c1cnc(s1)[C@@]1(O)CCCc2cc(ccc12)P(O)(O)=O
Show InChI InChI=1S/C25H22F3N4O4PS/c1-14-9-19(31-22(10-14)32-21-12-16(6-8-29-21)25(26,27)28)20-13-30-23(38-20)24(33)7-2-3-15-11-17(37(34,35)36)4-5-18(15)24/h4-6,8-13,33H,2-3,7H2,1H3,(H,29,31,32)(H2,34,35,36)/t24-/m1/s1
NCI pathway
Reactome pathway
US Patent
n/an/a<0.5n/an/an/an/a7.5n/a
Merck Sharp & Dohme Corp.
US Patent
Assay Description
A recombinant GST-hSyk fusion protein was used to measure potency of compounds to inhibit human Syk activity. The recombinant human GST-Syk (Cama Bio...
US Patent US8796310 (2014)
BindingDB Entry DOI: 10.7270/Q29W0D61